program: Orca
programVersion: 4.2.1
elementType: F F O N N N C C C C C C C C C C C C C C C C C C C C H H H H H H H H H H H H H H H H H H H H H H H
charge: 0
multiplicity: 1
keywords: wb97x-d3
keywords: def2-TZVPP
keywords: def2/J RIJCOSX GRIDX6 NOFINALGRIDX
keywords: grid4 nofinalgrid
keywords: scfconv7
keywords: smallprint printgap noloewdin
keywords: NOSOSCF
formula: C20H23F2N3O
InChI: InChI=1/C20H23F2N3O/c1-10(2)16-12-7-8-13(16)17-11(12)5-4-6-15(17)23-20(26)14-9-25(3)24-18(14)19(21)22/h4-6,9-10,12-13,16,19,23H,7-8H2,1-3H3
49 atoms
F  2.375454 0.150708 -2.701277
F  3.279546 2.107476 -2.356712
O  0.890633 -0.925328 1.845683
N  0.547134 -0.901455 -0.397964
N  4.744929 0.311162 0.828865
N  4.45836 0.895495 -0.326541
C  -3.267381 0.96665 0.81956
C  -1.887846 0.388783 1.216437
C  -3.992203 -0.389396 0.990325
C  -2.212432 -0.178486 2.620295
C  -3.65923 -0.707096 2.465922
C  -1.808253 -0.79098 0.284379
C  -3.114904 -1.276764 0.150222
C  -3.368832 1.64365 -0.544451
C  -0.77404 -1.392936 -0.409463
C  -3.408131 -2.35896 -0.652478
C  -2.459573 2.867027 -0.609021
C  -4.810512 2.04164 -0.844736
C  -1.067844 -2.484845 -1.234933
C  -2.362814 -2.958581 -1.355403
C  1.291448 -0.692495 0.718682
C  2.643039 -0.158603 0.482474
C  3.192363 0.622657 -0.557888
C  3.695273 -0.322135 1.359598
C  2.5198 1.154342 -1.774946
C  6.077479 0.39964 1.383737
H  -3.610158 1.68127 1.579374
H  -1.043156 1.074325 1.201273
H  -5.05506 -0.425165 0.754882
H  -2.160404 0.619087 3.363541
H  -1.504998 -0.948324 2.920732
H  -3.750499 -1.77106 2.686936
H  -4.349291 -0.180532 3.12757
H  -3.044762 0.941854 -1.320511
H  -4.422859 -2.722553 -0.759337
H  -1.406925 2.60567 -0.48735
H  -2.554182 3.3778 -1.569297
H  -2.711402 3.589577 0.172043
H  -5.203322 2.716116 -0.079076
H  -4.884029 2.558608 -1.80365
H  -5.475015 1.177627 -0.894592
H  -0.268934 -2.957834 -1.794043
H  -2.560778 -3.79893 -2.008509
H  1.043281 -0.988462 -1.271513
H  3.754877 -0.848255 2.298934
H  1.529152 1.565173 -1.575505
H  6.521146 -0.590438 1.465481
H  6.685002 1.007887 0.721343
H  6.048556 0.863134 2.367472
elementType: F O N C H
totalener: -1215.30020873 hartree
nucrepener: 2421.40455639 hartree
electener: -3636.70476512 hartree
oneelecener: -6471.53049250 hartree
twoeener: 2834.82572738 hartree
cpcmener: -0.02918012 hartree
kineticenergy: 1210.17949375 hartree
xcener: -115.777211856815 hartree
chargesum: -0.0000000
charge: -0.219853 -0.202677 -0.484399 -0.197636 0.114860 -0.307944 -0.149681 0.240596 0.237191 -0.218830 -0.199581 -0.210608 -0.181249 -0.003172 0.119034 -0.197054 -0.293022 -0.295433 -0.224536 -0.125846 0.367113 -0.106101 0.018969 -0.042250 0.251558 -0.155656 0.081042 0.096339 0.083940 0.087280 0.085401 0.083057 0.087445 0.040767 0.144315 0.083856 0.092315 0.086231 0.084314 0.091046 0.091461 0.137384 0.155804 0.187226 0.179127 0.118345 0.128601 0.113400 0.127512
qa: -0.2199 -0.2027 -0.4844 -0.1976 0.1149 -0.3079 -0.1497 0.2406 0.2372 -0.2188 -0.1996 -0.2106 -0.1812 -0.0032 0.1190 -0.1971 -0.2930 -0.2954 -0.2245 -0.1258 0.3671 -0.1061 0.0190 -0.0422 0.2516 -0.1557 0.0810 0.0963 0.0839 0.0873 0.0854 0.0831 0.0874 0.0408 0.1443 0.0839 0.0923 0.0862 0.0843 0.0910 0.0915 0.1374 0.1558 0.1872 0.1791 0.1183 0.1286 0.1134 0.1275
va: 1.0325 1.0818 2.0310 3.1981 3.4082 2.9575 4.0906 3.5410 3.5984 3.9433 3.9463 3.7277 3.6980 3.8375 3.7287 3.9704 3.9192 3.9177 3.9958 3.8938 4.1469 3.5497 3.9074 4.0352 4.2460 3.8660 1.0016 0.9996 1.0006 1.0056 1.0335 1.0122 1.0085 1.0160 1.0008 1.0056 1.0056 1.0037 1.0032 1.0057 1.0039 1.0078 0.9903 1.0206 0.9992 0.9801 0.9874 1.0085 0.9883
dispcorr: -0.025724466 hartree
energy: -1215.325933193922
dipole: -32.06479 32.68131 0.61652 6.05550 -6.10063 -0.04513 13.34609 -12.70497 0.64112
magnitude: 0.89060 au
magnitude: 2.26372 debye
