program: Orca
programVersion: 4.2.1
elementType: F F O N N N C C C C C C C C C C C C C C C C C C C C H H H H H H H H H H H H H H H H H H H H H H H
charge: 0
multiplicity: 1
keywords: wb97x-d3
keywords: def2-TZVPP
keywords: def2/J RIJCOSX GRIDX6 NOFINALGRIDX
keywords: grid4 nofinalgrid
keywords: scfconv7
keywords: smallprint printgap noloewdin
keywords: NOSOSCF
formula: C20H23F2N3O
InChI: InChI=1/C20H23F2N3O/c1-10(2)16-12-7-8-13(16)17-11(12)5-4-6-15(17)23-20(26)14-9-25(3)24-18(14)19(21)22/h4-6,9-10,12-13,16,19,23H,7-8H2,1-3H3
49 atoms
F  2.433627 0.012109 -2.70449
F  3.365406 1.970717 -2.457282
O  0.867697 -0.821789 1.864819
N  0.545921 -0.878738 -0.382424
N  4.740966 0.342993 0.855161
N  4.483368 0.865784 -0.335936
C  -3.297356 0.968133 0.831996
C  -1.913036 0.401037 1.230111
C  -4.008938 -0.395764 0.990569
C  -2.238573 -0.176359 2.629164
C  -3.678619 -0.720015 2.464998
C  -1.817359 -0.773554 0.291593
C  -3.120018 -1.268321 0.147348
C  -3.403289 1.653151 -0.52753
C  -0.775916 -1.366973 -0.400257
C  -3.404504 -2.343887 -0.666821
C  -2.505462 2.885248 -0.584017
C  -4.848421 2.039756 -0.826593
C  -1.061848 -2.452954 -1.236942
C  -2.353202 -2.931175 -1.37041
C  1.280578 -0.634962 0.734201
C  2.63983 -0.122984 0.493124
C  3.21861 0.594842 -0.577083
C  3.673948 -0.24917 1.398193
C  2.578507 1.066167 -1.836209
C  6.062151 0.449355 1.432491
H  -3.648885 1.673307 1.596342
H  -1.075663 1.095157 1.222113
H  -5.07037 -0.441639 0.750861
H  -2.199568 0.618556 3.375903
H  -1.524488 -0.939767 2.929547
H  -3.758891 -1.786311 2.678329
H  -4.377452 -0.205487 3.126807
H  -3.072319 0.959302 -1.30784
H  -4.416749 -2.71112 -0.782062
H  -2.766323 3.601946 0.199119
H  -1.451107 2.632597 -0.460767
H  -2.602933 3.39863 -1.542549
H  -4.925577 2.559921 -1.78336
H  -5.504952 1.170081 -0.880523
H  -5.247357 2.707438 -0.058467
H  -0.258267 -2.919157 -1.795028
H  -2.542948 -3.765023 -2.033849
H  1.055038 -1.002938 -1.243964
H  3.710259 -0.723391 2.365502
H  1.591399 1.50478 -1.681056
H  6.021077 0.984712 2.378689
H  6.484838 -0.539588 1.596645
H  6.695117 0.996381 0.741117
elementType: F O N C H
totalener: -1215.30003792 hartree
nucrepener: 2418.67133358 hartree
electener: -3633.97137150 hartree
oneelecener: -6466.06380337 hartree
twoeener: 2832.09243187 hartree
cpcmener: -0.02879508 hartree
kineticenergy: 1210.18352809 hartree
xcener: -115.778223146392 hartree
chargesum: 0.0000000
charge: -0.219512 -0.202252 -0.484360 -0.200686 0.114494 -0.307734 -0.149820 0.244124 0.237841 -0.218573 -0.199947 -0.209845 -0.178871 -0.003276 0.114423 -0.198602 -0.293772 -0.295459 -0.222724 -0.126767 0.373622 -0.107293 0.020006 -0.041822 0.247531 -0.155478 0.080911 0.095328 0.083955 0.087035 0.084818 0.082961 0.087360 0.040661 0.144226 0.085823 0.084826 0.092247 0.090970 0.091449 0.084366 0.135950 0.155918 0.186601 0.178902 0.120848 0.127592 0.128669 0.113336
qa: -0.2195 -0.2023 -0.4844 -0.2007 0.1145 -0.3077 -0.1498 0.2441 0.2378 -0.2186 -0.1999 -0.2098 -0.1789 -0.0033 0.1144 -0.1986 -0.2938 -0.2955 -0.2227 -0.1268 0.3736 -0.1073 0.0200 -0.0418 0.2475 -0.1555 0.0809 0.0953 0.0840 0.0870 0.0848 0.0830 0.0874 0.0407 0.1442 0.0858 0.0848 0.0922 0.0910 0.0914 0.0844 0.1360 0.1559 0.1866 0.1789 0.1208 0.1276 0.1287 0.1133
va: 1.0322 1.0821 2.0313 3.2067 3.4090 2.9567 4.0909 3.5393 3.5969 3.9406 3.9457 3.7244 3.6978 3.8371 3.7390 3.9723 3.9187 3.9170 3.9881 3.8986 4.1411 3.5509 3.9044 4.0349 4.2411 3.8657 1.0015 1.0014 1.0007 1.0056 1.0341 1.0121 1.0085 1.0160 1.0009 1.0036 1.0058 1.0055 1.0057 1.0039 1.0032 1.0082 0.9904 1.0217 0.9996 0.9798 0.9880 0.9874 1.0087
dispcorr: -0.025626433 hartree
energy: -1215.325664357506
dipole: -32.62120 33.22715 0.60595 6.60972 -6.60401 0.00571 13.69760 -13.01574 0.68186
magnitude: 0.91221 au
magnitude: 2.31867 debye
