program: Orca
programVersion: 4.2.1
elementType: F F O N N N C C C C C C C C C C C C C C C C C C C C H H H H H H H H H H H H H H H H H H H H H H H
charge: 0
multiplicity: 1
keywords: wb97x-d3
keywords: def2-TZVPP
keywords: def2/J RIJCOSX GRIDX6 NOFINALGRIDX
keywords: grid4 nofinalgrid
keywords: scfconv7
keywords: smallprint printgap noloewdin
keywords: NOSOSCF
formula: C20H23F2N3O
InChI: InChI=1/C20H23F2N3O/c1-10(2)16-12-7-8-13(16)17-11(12)5-4-6-15(17)23-20(26)14-9-25(3)24-18(14)19(21)22/h4-6,9-10,12-13,16,19,23H,7-8H2,1-3H3
49 atoms
F  2.895774 -1.512561 2.167296
F  2.222524 0.505298 2.639996
O  0.519499 0.24128 -1.621244
N  0.564714 -0.943909 0.304595
N  4.523621 0.976573 -0.971456
N  4.613003 0.672464 0.314463
C  -3.214123 1.276178 -0.465875
C  -1.928653 1.012755 0.353911
C  -4.047025 0.240369 0.322748
C  -2.435829 1.311389 1.78598
C  -3.893615 0.788655 1.76241
C  -1.837839 -0.487625 0.252446
C  -3.152226 -0.966317 0.243227
C  -3.107984 1.094216 -1.977926
C  -0.778053 -1.375573 0.259279
C  -3.428877 -2.318242 0.254621
C  -2.263276 2.207222 -2.590463
C  -4.487355 1.062814 -2.627639
C  -1.051434 -2.746906 0.25225
C  -2.357071 -3.210659 0.257066
C  1.129158 -0.156647 -0.640888
C  2.54251 0.213273 -0.444432
C  3.431198 0.203595 0.656567
C  3.308451 0.732827 -1.468994
C  3.244363 -0.189661 2.074328
C  5.647122 1.576746 -1.652864
H  -3.59076 2.28851 -0.2693
H  -1.041774 1.573861 0.072243
H  -5.080256 0.084562 0.015397
H  -2.404039 2.385717 1.976059
H  -1.821086 0.83124 2.548058
H  -4.086754 0.024218 2.515902
H  -4.60645 1.597407 1.933632
H  -2.609705 0.142312 -2.189189
H  -4.448374 -2.684232 0.261377
H  -2.163869 2.074567 -3.669871
H  -2.718239 3.187423 -2.423212
H  -1.25589 2.231771 -2.175484
H  -5.079788 0.207306 -2.299152
H  -5.057327 1.967317 -2.397394
H  -4.406768 0.997224 -3.714766
H  -0.229459 -3.452694 0.237356
H  -2.540738 -4.277435 0.252346
H  1.170835 -1.437703 0.939866
H  3.061306 0.927824 -2.499733
H  4.150994 -0.036554 2.659585
H  5.715917 2.635916 -1.413803
H  6.562288 1.078335 -1.348293
H  5.519733 1.460394 -2.72432
elementType: F O N C H
totalener: -1215.30279067 hartree
nucrepener: 2439.47984847 hartree
electener: -3654.78263914 hartree
oneelecener: -6508.64290057 hartree
twoeener: 2853.86026143 hartree
cpcmener: -0.02664474 hartree
kineticenergy: 1210.18442319 hartree
xcener: -115.777179993819 hartree
chargesum: -0.0000000
charge: -0.227815 -0.211789 -0.489649 -0.191277 0.099754 -0.290048 -0.140065 0.220705 0.204379 -0.214605 -0.193952 -0.145513 -0.173277 0.010329 0.084097 -0.200990 -0.302644 -0.306737 -0.221962 -0.124005 0.364415 -0.132593 -0.011797 -0.033625 0.323949 -0.142946 0.082862 0.086842 0.086848 0.089453 0.081462 0.081449 0.087528 0.035984 0.143792 0.090722 0.082833 0.090117 0.089460 0.086991 0.092084 0.136595 0.155012 0.190501 0.173282 0.120094 0.127717 0.122030 0.114002
qa: -0.2278 -0.2118 -0.4896 -0.1913 0.0998 -0.2900 -0.1401 0.2207 0.2044 -0.2146 -0.1940 -0.1455 -0.1733 0.0103 0.0841 -0.2010 -0.3026 -0.3067 -0.2220 -0.1240 0.3644 -0.1326 -0.0118 -0.0336 0.3239 -0.1429 0.0829 0.0868 0.0868 0.0895 0.0815 0.0814 0.0875 0.0360 0.1438 0.0907 0.0828 0.0901 0.0895 0.0870 0.0921 0.1366 0.1550 0.1905 0.1733 0.1201 0.1277 0.1220 0.1140
va: 1.0482 1.0640 2.0216 3.1999 3.4279 2.9393 4.0749 3.5760 3.6629 3.9721 3.9505 3.6515 3.7065 3.8073 3.7531 3.9699 3.9059 3.9254 4.0094 3.8815 4.1405 3.6201 4.0471 4.0528 4.1781 3.8714 0.9991 1.0022 0.9975 1.0066 1.0142 1.0122 1.0091 1.0286 1.0010 1.0043 1.0054 1.0169 1.0022 1.0022 1.0050 1.0091 0.9907 1.0307 1.0026 0.9977 0.9879 0.9989 0.9966
dispcorr: -0.026041503 hartree
energy: -1215.328832173012
dipole: -29.41874 31.07822 1.65948 13.24893 -12.78036 0.46856 -17.66729 17.36816 -0.29913
magnitude: 1.75011 au
magnitude: 4.44844 debye
