program: Orca
programVersion: 4.2.1
elementType: F F O N N N C C C C C C C C C C C C C C C C C C C C H H H H H H H H H H H H H H H H H H H H H H H
charge: 0
multiplicity: 1
keywords: wb97x-d3
keywords: def2-TZVPP
keywords: def2/J RIJCOSX GRIDX6 NOFINALGRIDX
keywords: grid4 nofinalgrid
keywords: scfconv7
keywords: smallprint printgap noloewdin
keywords: NOSOSCF
formula: C20H23F2N3O
InChI: InChI=1/C20H23F2N3O/c1-10(2)16-12-7-8-13(16)17-11(12)5-4-6-15(17)23-20(26)14-9-25(3)24-18(14)19(21)22/h4-6,9-10,12-13,16,19,23H,7-8H2,1-3H3
49 atoms
F  5.052811 -1.550907 1.384309
F  5.748579 -1.292705 -0.664647
O  1.668711 -2.024449 -0.577117
N  0.16978 -0.433016 0.059322
N  3.596049 2.002864 0.016017
N  4.519372 1.05584 0.078269
C  -3.7951 1.350749 0.035879
C  -2.412935 1.0702 0.671829
C  -4.444571 0.099457 0.669678
C  -2.788344 1.04464 2.173037
C  -4.183122 0.370458 2.17148
C  -2.204265 -0.367304 0.263037
C  -3.464005 -0.964908 0.256297
C  -3.859005 1.466916 -1.484573
C  -1.058668 -1.102482 -0.012429
C  -3.620403 -2.302297 -0.046626
C  -3.01157 2.634878 -1.97826
C  -5.30381 1.630844 -1.94622
C  -1.212442 -2.456602 -0.343415
C  -2.475194 -3.031131 -0.358817
C  1.41661 -0.881696 -0.229232
C  2.47722 0.130366 -0.093115
C  3.867999 -0.085581 0.005974
C  2.359427 1.507937 -0.086433
C  4.625924 -1.36408 0.100416
C  3.971295 3.39948 0.045212
H  -4.225545 2.264801 0.464906
H  -1.617075 1.775839 0.430013
H  -5.48772 -0.101325 0.430004
H  -2.841004 2.062571 2.563351
H  -2.053396 0.505755 2.771791
H  -4.215794 -0.543466 2.76521
H  -4.946379 1.041457 2.569346
H  -3.464023 0.549065 -1.933275
H  -4.595518 -2.773253 -0.054133
H  -1.953436 2.505205 -1.745087
H  -3.088369 2.744788 -3.061784
H  -3.335559 3.578148 -1.530311
H  -5.924004 0.776143 -1.671557
H  -5.760602 2.523123 -1.509796
H  -5.360993 1.732686 -3.031716
H  -0.358491 -3.066554 -0.586709
H  -2.561195 -4.077927 -0.62167
H  0.1086 0.501998 0.428869
H  1.504197 2.159852 -0.174586
H  4.051415 -2.23573 -0.20145
H  5.052457 3.46072 0.113395
H  3.641319 3.899373 -0.862852
H  3.530183 3.892772 0.908724
elementType: F O N C H
totalener: -1215.30114089 hartree
nucrepener: 2354.83322673 hartree
electener: -3570.13436762 hartree
oneelecener: -6337.35277500 hartree
twoeener: 2767.21840738 hartree
cpcmener: -0.03429273 hartree
kineticenergy: 1210.17868747 hartree
xcener: -115.781407200728 hartree
chargesum: -0.0000000
charge: -0.221400 -0.217819 -0.509715 -0.159875 0.119680 -0.308909 -0.159716 0.160001 0.223739 -0.176800 -0.202310 -0.206580 -0.179545 -0.006403 0.169958 -0.220735 -0.297783 -0.293330 -0.234852 -0.131539 0.452796 -0.117162 -0.004016 -0.038470 0.262303 -0.155379 0.084855 0.086098 0.086838 0.088620 0.080247 0.084446 0.089028 0.045374 0.143551 0.089670 0.093025 0.086267 0.091866 0.083177 0.092551 0.150155 0.155375 0.178011 0.161994 0.112238 0.114381 0.127774 0.128320
qa: -0.2214 -0.2178 -0.5097 -0.1599 0.1197 -0.3089 -0.1597 0.1600 0.2237 -0.1768 -0.2023 -0.2066 -0.1795 -0.0064 0.1700 -0.2207 -0.2978 -0.2933 -0.2349 -0.1315 0.4528 -0.1172 -0.0040 -0.0385 0.2623 -0.1554 0.0849 0.0861 0.0868 0.0886 0.0802 0.0844 0.0890 0.0454 0.1436 0.0897 0.0930 0.0863 0.0919 0.0832 0.0926 0.1502 0.1554 0.1780 0.1620 0.1122 0.1144 0.1278 0.1283
va: 1.0424 1.0533 2.0001 3.2937 3.3973 2.9621 4.0682 3.6452 3.6206 3.9523 3.9614 3.7023 3.6812 3.8389 3.8057 3.9843 3.9192 3.9181 3.9610 3.8997 4.0693 3.5961 3.9139 4.0219 4.2197 3.8658 1.0012 0.9967 0.9992 1.0087 1.0148 1.0121 1.0091 1.0160 1.0004 1.0023 1.0055 1.0029 1.0046 1.0033 1.0050 1.0404 0.9919 1.0103 1.0006 1.0070 1.0085 0.9881 0.9875
dispcorr: -0.024144803 hartree
energy: -1215.325285689323
dipole: -51.23680 48.63018 -2.60661 24.38722 -20.74012 3.64711 -4.03815 4.43676 0.39861
magnitude: 4.50052 au
magnitude: 11.43942 debye
