program: Orca
programVersion: 4.2.1
elementType: F F O N N N C C C C C C C C C C C C C C C C C C C C H H H H H H H H H H H H H H H H H H H H H H H
charge: 0
multiplicity: 1
keywords: wb97x-d3
keywords: def2-TZVPP
keywords: def2/J RIJCOSX GRIDX6 NOFINALGRIDX
keywords: grid4 nofinalgrid
keywords: scfconv7
keywords: smallprint printgap noloewdin
keywords: NOSOSCF
formula: C20H23F2N3O
InChI: InChI=1/C20H23F2N3O/c1-10(2)16-12-7-8-13(16)17-11(12)5-4-6-15(17)23-20(26)14-9-25(3)24-18(14)19(21)22/h4-6,9-10,12-13,16,19,23H,7-8H2,1-3H3
49 atoms
F  2.662867 -0.527519 -2.690924
F  2.998732 -2.218817 -1.359087
O  0.877278 -0.392041 1.822212
N  0.524013 -0.473872 -0.412471
N  4.570643 1.2265 0.738969
N  4.746516 0.523147 -0.368996
C  -3.394865 1.2669 0.650408
C  -1.982856 0.802921 1.082607
C  -4.040625 -0.110287 0.93655
C  -2.26967 0.333657 2.529867
C  -3.683481 -0.28864 2.430571
C  -1.839484 -0.441581 0.249969
C  -3.115976 -1.0120 0.164342
C  -3.538598 1.820378 -0.765263
C  -0.772159 -1.037405 -0.393468
C  -3.33991 -2.175136 -0.541029
C  -2.707569 3.087787 -0.939832
C  -5.00216 2.09922 -1.091998
C  -0.996183 -2.21016 -1.123172
C  -2.260129 -2.769834 -1.19602
C  1.282556 -0.247878 0.680195
C  2.661379 0.212575 0.419988
C  3.604589 -0.097148 -0.584155
C  3.347179 1.066725 1.256468
C  3.518537 -1.021358 -1.740999
C  5.614016 2.100876 1.223645
H  -3.777204 2.020623 1.351207
H  -1.175065 1.527576 1.004418
H  -5.10078 -0.226069 0.714728
H  -2.260335 1.190431 3.206224
H  -1.516656 -0.3672 2.883538
H  -3.710372 -1.335323 2.73579
H  -4.400905 0.247385 3.054791
H  -3.171088 1.077045 -1.480977
H  -4.329658 -2.610181 -0.608957
H  -1.641045 2.904422 -0.799782
H  -2.832114 3.504013 -1.941635
H  -3.005868 3.860034 -0.225661
H  -5.107894 2.518776 -2.094515
H  -5.611241 1.194575 -1.057166
H  -5.436654 2.816371 -0.390377
H  -0.165966 -2.678739 -1.638235
H  -2.408368 -3.674242 -1.772048
H  0.922984 -0.304954 -1.322242
H  3.034174 1.566924 2.158794
H  4.489693 -1.183462 -2.209138
H  5.614524 2.102527 2.310586
H  6.572516 1.733568 0.868576
H  5.461963 3.117102 0.862562
elementType: F O N C H
totalener: -1215.30217256 hartree
nucrepener: 2422.10348612 hartree
electener: -3637.40565868 hartree
oneelecener: -6473.56135588 hartree
twoeener: 2836.15569719 hartree
cpcmener: -0.02833974 hartree
kineticenergy: 1210.18288089 hartree
xcener: -115.776366366879 hartree
chargesum: -0.0000000
charge: -0.229393 -0.216412 -0.495489 -0.210618 0.099175 -0.293596 -0.144979 0.231380 0.237089 -0.217505 -0.201402 -0.191323 -0.187775 -0.006008 0.141654 -0.186600 -0.294159 -0.294239 -0.231913 -0.128843 0.353391 -0.117222 -0.022303 -0.043326 0.326710 -0.146426 0.080352 0.094369 0.084225 0.086796 0.085922 0.083218 0.087298 0.040543 0.144372 0.088690 0.091597 0.084175 0.091046 0.091048 0.084171 0.134182 0.156526 0.195343 0.177102 0.125320 0.120346 0.115809 0.127684
qa: -0.2294 -0.2164 -0.4955 -0.2106 0.0992 -0.2936 -0.1450 0.2314 0.2371 -0.2175 -0.2014 -0.1913 -0.1878 -0.0060 0.1417 -0.1866 -0.2942 -0.2942 -0.2319 -0.1288 0.3534 -0.1172 -0.0223 -0.0433 0.3267 -0.1464 0.0804 0.0944 0.0842 0.0868 0.0859 0.0832 0.0873 0.0405 0.1444 0.0887 0.0916 0.0842 0.0910 0.0910 0.0842 0.1342 0.1565 0.1953 0.1771 0.1253 0.1203 0.1158 0.1277
va: 1.0433 1.0635 2.0250 3.1936 3.4167 2.9584 4.0838 3.5456 3.5961 3.9413 3.9477 3.6769 3.6949 3.8424 3.6972 3.9685 3.9151 3.9164 4.0059 3.8894 4.1749 3.6327 4.0411 4.0453 4.1646 3.8687 1.0018 0.9995 1.0003 1.0054 1.0342 1.0118 1.0085 1.0158 1.0005 1.0064 1.0055 1.0035 1.0056 1.0041 1.0031 1.0162 0.9910 1.0205 0.9981 0.9959 0.9928 1.0046 0.9864
dispcorr: -0.025885045 hartree
energy: -1215.328057607688
dipole: -33.04159 34.08240 1.04081 20.63907 -18.82174 1.81733 9.24666 -9.30684 -0.06018
magnitude: 2.09514 au
magnitude: 5.32542 debye
