program: Orca
programVersion: 4.2.1
elementType: F F O N N N C C C C C C C C C C C C C C C C C C C C H H H H H H H H H H H H H H H H H H H H H H H
charge: 0
multiplicity: 1
keywords: wb97x-d3
keywords: def2-TZVPP
keywords: def2/J RIJCOSX GRIDX6 NOFINALGRIDX
keywords: grid4 nofinalgrid
keywords: scfconv7
keywords: smallprint printgap noloewdin
keywords: NOSOSCF
formula: C20H23F2N3O
InChI: InChI=1/C20H23F2N3O/c1-10(2)16-12-7-8-13(16)17-11(12)5-4-6-15(17)23-20(26)14-9-25(3)24-18(14)19(21)22/h4-6,9-10,12-13,16,19,23H,7-8H2,1-3H3
49 atoms
F  1.692162 1.06967 2.132377
F  1.397458 2.216641 0.302491
O  1.946899 -2.57724 -0.500706
N  0.57536 -0.794508 -0.161033
N  5.059266 0.096569 -0.41783
N  4.49494 1.09197 0.248743
C  -3.295124 1.211396 -0.161651
C  -1.901053 0.912942 0.435621
C  -3.976003 0.05886 0.608438
C  -2.20012 1.031073 1.949602
C  -3.62955 0.44577 2.06752
C  -1.783011 -0.564822 0.146062
C  -3.071227 -1.08965 0.254266
C  -3.410956 1.198355 -1.683852
C  -0.692949 -1.389401 -0.103983
C  -3.313226 -2.439875 0.104199
C  -2.570443 2.311948 -2.300547
C  -4.866565 1.335341 -2.118714
C  -0.936259 -2.759758 -0.282414
C  -2.225048 -3.261763 -0.17729
C  1.787583 -1.383759 -0.297181
C  2.965969 -0.500159 -0.198375
C  3.228955 0.759223 0.390416
C  4.194456 -0.881287 -0.699395
C  2.361438 1.703592 1.133606
C  6.465421 0.135086 -0.753703
H  -3.660222 2.181252 0.200411
H  -1.08993 1.557236 0.101298
H  -5.038212 -0.105794 0.433921
H  -2.173289 2.077968 2.256987
H  -1.466399 0.498031 2.554815
H  -3.687571 -0.40794 2.743442
H  -4.334121 1.195118 2.43288
H  -3.035174 0.242425 -2.064396
H  -4.311281 -2.850815 0.192176
H  -2.664463 2.318167 -3.388294
H  -2.885929 3.294609 -1.939585
H  -1.508465 2.20389 -2.07379
H  -5.312157 2.256333 -1.733051
H  -4.949245 1.364137 -3.207151
H  -5.481384 0.502479 -1.773698
H  -0.130032 -3.437125 -0.508374
H  -2.377481 -4.323598 -0.324235
H  0.562442 0.211569 -0.131014
H  4.487856 -1.770924 -1.233239
H  2.927152 2.536892 1.549881
H  6.989487 -0.694715 -0.284351
H  6.598107 0.080813 -1.831975
H  6.880206 1.069786 -0.390489
elementType: F O N C H
totalener: -1215.30253564 hartree
nucrepener: 2436.00948500 hartree
electener: -3651.31202064 hartree
oneelecener: -6500.88029769 hartree
twoeener: 2849.56827704 hartree
cpcmener: -0.02595200 hartree
kineticenergy: 1210.17170221 hartree
xcener: -115.779150054426 hartree
chargesum: -0.0000000
charge: -0.216568 -0.229083 -0.503122 -0.187814 0.104169 -0.297005 -0.154595 0.148420 0.218438 -0.175294 -0.203736 -0.226618 -0.165717 -0.008095 0.180896 -0.223861 -0.294042 -0.295531 -0.240596 -0.127858 0.425380 -0.141140 -0.030057 -0.028723 0.326358 -0.154440 0.084706 0.095947 0.086248 0.090072 0.077266 0.083987 0.088402 0.045318 0.142089 0.093241 0.084702 0.088229 0.084663 0.092069 0.091116 0.148894 0.153976 0.196606 0.174642 0.128538 0.128749 0.128531 0.112241
qa: -0.2166 -0.2291 -0.5031 -0.1878 0.1042 -0.2970 -0.1546 0.1484 0.2184 -0.1753 -0.2037 -0.2266 -0.1657 -0.0081 0.1809 -0.2239 -0.2940 -0.2955 -0.2406 -0.1279 0.4254 -0.1411 -0.0301 -0.0287 0.3264 -0.1544 0.0847 0.0959 0.0862 0.0901 0.0773 0.0840 0.0884 0.0453 0.1421 0.0932 0.0847 0.0882 0.0847 0.0921 0.0911 0.1489 0.1540 0.1966 0.1746 0.1285 0.1287 0.1285 0.1122
va: 1.0642 1.0509 2.0077 3.2777 3.4176 2.9715 4.1050 3.6353 3.6283 3.9426 3.9678 3.7132 3.6778 3.8387 3.7969 3.9857 3.9157 3.9197 3.9680 3.8975 4.1186 3.6408 4.0473 4.0364 4.1554 3.8658 1.0006 1.0055 0.9988 1.0078 1.0213 1.0121 1.0091 1.0160 1.0010 1.0051 1.0036 1.0053 1.0031 1.0052 1.0038 1.0433 0.9922 1.0196 1.0029 0.9954 0.9876 0.9876 1.0087
dispcorr: -0.025733117 hartree
energy: -1215.328268756093
dipole: -27.03131 28.40526 1.37395 6.36882 -4.98843 1.38040 -10.43035 10.01156 -0.41879
magnitude: 1.99214 au
magnitude: 5.06361 debye
