program: Gaussian 09
title: 000074407
version: EM64L-G09RevD.01
frameworkgroup: C1[X(C11H20O4)]
method: RPBEPBE
basis: SDD
operation: Freq
keyword: #pfreq=noraman
keyword: PBEPBE/SDD
title: #p freq=noraman PBEPBE/SDD
converged: YES YES NO NO
title: Mulliken charges:
elementType: O O O O C C C C C C C C C C C H H H H H H H H H H H H H H H H H H H H
charge: -0.269137 -0.269112 -0.238550 -0.238706 -0.377582 -0.507801 -0.507536 0.247302 0.247493 -0.229609 -0.229645 -0.380705 -0.380679 -0.678591 -0.678610 0.241833 0.242238 0.235027 0.244063 0.234525 0.244025 0.219477 0.222774 0.219265 0.223071 0.214678 0.215677 0.214691 0.215685 0.212635 0.213481 0.226100 0.212598 0.213520 0.226101
chargesum: 0.00000
title: Mulliken charges with hydrogens summed into heavy atoms:
elementType: O O O O C C C C C C C C C C C
charge: -0.269137 -0.269112 -0.238550 -0.238706 0.106490 -0.028711 -0.028986 0.247302 0.247493 0.212642 0.212692 0.049651 0.049698 -0.026376 -0.026390
polarizability: 1.89192035e+02 -2.32986833e-02 1.14402551e+02 4.90300944e+00 -3.26847284e-02 1.02977367e+02
1716.lowfreq: -11.2342 -0.8106 -0.0015 -0.0002 0.0006 6.9258 11.4209 11.8117 34.6993
frequency: 10.8671 11.5893 34.6827 46.5457 48.2552 54.8800 59.6294 70.6431 91.2234 104.3185 144.3746 177.1610 177.4904 198.0168 224.0054 224.8186 241.1668 304.9781 309.4797 336.5117 343.9992 462.7568 497.4742 565.4551 567.6758 676.5317 696.3461 745.5470 755.0032 755.1610 842.8063 856.4251 873.7684 877.2219 877.2977 888.1408 900.6345 953.5172 964.6848 1049.8370 1050.9075 1053.7446 1054.6130 1080.8509 1113.8070 1129.7262 1135.9688 1135.9944 1143.2935 1144.0476 1173.7576 1227.5128 1227.7175 1246.9938 1268.1407 1278.1260 1278.2338 1284.5963 1303.0274 1304.8076 1337.2943 1364.1154 1373.4976 1375.6850 1394.7203 1394.7448 1441.9264 1448.1736 1470.5380 1470.6288 1478.1971 1478.2057 1480.4474 1480.5902 1482.5714 1490.1836 1490.2228 1638.8730 1641.1216 2976.3735 2978.0801 2980.0787 2980.1954 2997.2779 2997.3706 3004.4381 3004.4932 3019.2464 3043.2524 3043.2866 3047.4171 3055.4341 3065.5068 3065.5498 3084.0793 3084.1040 3085.6119 3085.6694 3087.7462
redmass: 3.7500 4.4334 2.5713 3.8866 2.6731 2.8124 2.5394 1.8599 2.7458 3.6756 3.9424 4.5903 3.3677 2.9314 1.1036 1.1034 3.9086 3.6964 4.8324 3.6223 4.3923 3.7774 3.4918 3.1790 3.5431 4.0966 6.3576 1.3129 1.0768 1.0793 1.7491 8.8975 3.6724 1.1571 1.1633 2.1469 2.1265 3.6965 3.8706 2.6108 2.8481 2.0478 6.0591 2.4960 1.8207 3.3395 2.1971 2.1932 1.4768 1.5131 1.7533 1.2600 1.2581 1.2843 1.3631 1.0997 1.0995 1.0848 1.3192 1.3519 1.6184 1.5547 1.5841 1.6640 1.2163 1.2160 1.0907 1.0771 1.0723 1.0722 1.0606 1.0607 1.0415 1.0414 1.0863 1.0856 1.0857 9.7658 10.2298 1.0654 1.0650 1.0359 1.0359 1.0595 1.0596 1.0578 1.0577 1.0604 1.1017 1.1017 1.0941 1.0949 1.1045 1.1045 1.0991 1.0991 1.1047 1.1048 1.1029
irintensity: 0.2675 0.5892 0.0165 0.4554 0.8021 0.0009 0.2007 0.0133 0.2215 1.9800 0.2236 0.2429 7.5333 3.5945 0.1854 0.0678 10.3096 0.9400 28.5871 13.1973 0.6084 0.3858 5.3735 2.5199 8.6377 1.7886 2.9890 19.3596 4.2406 6.5728 8.4700 4.0597 14.3282 2.5568 0.8364 7.3595 1.7036 158.0720 1.6131 56.9910 0.0368 17.6533 1.6736 21.2282 11.1499 665.2802 3.1806 17.9211 0.3085 28.6551 1.1931 1.6435 0.5353 42.3870 174.5206 0.0231 0.0961 0.3750 1.3290 8.3759 0.3801 21.6291 1.1257 22.4794 17.7775 4.1186 4.2142 27.2497 3.0730 1.9990 0.7617 2.3628 13.1163 13.2059 17.2916 16.8451 24.0235 113.3097 227.0210 7.9169 13.2258 38.9459 25.0612 2.6957 1.1719 38.9660 48.2442 10.8539 0.4726 0.4756 5.1391 2.8684 0.0251 0.0084 37.2241 45.3460 99.6108 66.8251 53.6021
temp: 298.150 k
press: 1.00000 atm
elementType: 8 8 8 8 6 6 6 6 6 6 6 6 6 6 6 1 1 1 1 1 1 1 1 1 1 1 1 1 1 1 1 1 1 1 1
symmnumber: 1
zpe: 778013.7 jmol-1
zpe.correction: 0.296330 hartree
zpe.thermalcorrener: 0.315369 hartree
zpe.thermalcorrenthalpy: 0.316313 hartree
zpe.thermalcorrgfe: 0.243435 hartree
zpe.sumelectzpe: -730.863696 hartree
zpe.sumelectthermal: -730.844657 hartree
zpe.sumelectthermalent: -730.843713 hartree
zpe.sumelectthermalfe: -730.916590 hartree
dipole: 0.0063 -2.8901 -0.0028
dipole: 2.8901
quadrupole: -62.9285 -97.8907 -92.7939
quadrupole: 0.0146 3.7970 -0.0160
quadrupole: 21.6092 -13.3530 -8.2562 0.0146 3.7970 -0.0160
hfenergy: -731.1600259 hartree
pointgroup: C01 [X(C11H20O4)]
dipole: -0.0026562 -1.1365653 0.0334017 debye
polarizability: 189.3017432|0.1183765|114.3950576|3.815192|-0.2954839|102.8751524 unknown
InChI: InChI=1S/C11H20O4/c1-3-8-14-10(12)6-5-7-11(13)15-9-4-2/h3-9H2,1-2H3
charge 0 multiplicity 1
35 atoms
O  -3.65843 -0.516472 -0.043929
O  3.658006 -0.518855 0.042938
O  -2.536768 1.226693 1.020783
O  2.543455 1.164526 -1.120701
C  0.00194 0.167827 -0.020474
C  -1.268412 -0.697271 0.109759
C  1.268529 -0.707627 -0.116642
C  -2.507719 0.12918 0.417819
C  2.510379 0.100797 -0.460068
C  -4.957687 0.164106 0.247467
C  4.959123 0.145448 -0.276657
C  -6.065188 -0.708298 -0.344591
C  6.062103 -0.687662 0.377179
C  -7.459103 -0.089601 -0.095761
C  7.457967 -0.085936 0.099557
H  0.071109 0.847382 0.847712
H  -0.064114 0.812915 -0.914772
H  -1.149146 -1.424691 0.939925
H  -1.454553 -1.294163 -0.800922
H  1.144358 -1.466852 -0.917068
H  1.453231 -1.267837 0.817207
H  -5.055648 0.279832 1.343221
H  -4.933236 1.17373 -0.203164
H  5.067235 0.194653 -1.376454
H  4.929041 1.1805 0.111567
H  -6.01052 -1.717693 0.104307
H  -5.889491 -0.828769 -1.429889
H  6.010131 -1.723352 -0.007622
H  5.87873 -0.739597 1.46663
H  -7.664573 0.01782 0.985721
H  -7.543107 0.912422 -0.556427
H  -8.252023 -0.725544 -0.527261
H  7.670488 -0.045887 -0.985157
H  7.539827 0.942755 0.497647
H  8.247666 -0.694077 0.574819
