program: Orca
programVersion: 4.2.1
elementType: F F O N N N C C C C C C C C C C C C C C C C C C C C H H H H H H H H H H H H H H H H H H H H H H H
charge: 0
multiplicity: 1
keywords: wb97x-d3
keywords: def2-TZVPP
keywords: def2/J RIJCOSX GRIDX6 NOFINALGRIDX
keywords: grid4 nofinalgrid
keywords: scfconv7
keywords: smallprint printgap noloewdin
keywords: NOSOSCF
formula: C20H23F2N3O
InChI: InChI=1/C20H23F2N3O/c1-10(2)16-12-7-8-13(16)17-11(12)5-4-6-15(17)23-20(26)14-9-25(3)24-18(14)19(21)22/h4-6,9-10,12-13,16,19,23H,7-8H2,1-3H3
49 atoms
F  1.505909 1.996281 -1.454271
F  2.28181 0.360764 -2.670034
O  0.969131 -1.084555 1.741556
N  0.587067 -0.913067 -0.482522
N  4.751836 0.364238 0.87347
N  4.479943 1.002765 -0.255121
C  -3.146981 1.003544 0.834396
C  -1.774008 0.38602 1.189881
C  -3.902197 -0.337121 1.003336
C  -2.078571 -0.196907 2.591882
C  -3.542094 -0.685598 2.46592
C  -1.74676 -0.779093 0.238728
C  -3.066078 -1.23362 0.129597
C  -3.268231 1.69832 -0.519594
C  -0.739706 -1.389648 -0.485796
C  -3.396465 -2.299864 -0.680383
C  -2.263399 2.839591 -0.64106
C  -4.687396 2.216171 -0.730884
C  -1.071378 -2.462589 -1.320211
C  -2.37875 -2.909212 -1.415431
C  1.341202 -0.750961 0.627646
C  2.673733 -0.151939 0.432416
C  3.232027 0.700693 -0.547774
C  3.704131 -0.32646 1.332906
C  2.645485 1.320245 -1.761025
C  6.040356 0.518764 1.510362
H  -3.45082 1.716561 1.6119
H  -0.912978 1.050764 1.16394
H  -4.970856 -0.342153 0.79217
H  -1.986003 0.585388 3.347377
H  -1.384418 -0.990573 2.860085
H  -3.655049 -1.75027 2.673646
H  -4.201612 -0.151548 3.152514
H  -3.051387 0.976652 -1.314639
H  -4.41935 -2.645379 -0.768131
H  -1.232514 2.482459 -0.628977
H  -2.400954 3.385378 -1.57679
H  -2.373328 3.55824 0.175571
H  -5.4264 1.413381 -0.710798
H  -4.964881 2.938672 0.04129
H  -4.78325 2.717337 -1.696191
H  -0.294547 -2.942109 -1.903768
H  -2.609022 -3.737084 -2.073825
H  1.037569 -0.84379 -1.381202
H  3.748093 -0.89813 2.245875
H  3.345039 1.999971 -2.247619
H  6.355268 -0.429839 1.937108
H  6.764611 0.829512 0.763572
H  5.991603 1.268846 2.298146
elementType: F O N C H
totalener: -1215.30292688 hartree
nucrepener: 2451.46780891 hartree
electener: -3666.77073578 hartree
oneelecener: -6532.57369661 hartree
twoeener: 2865.80296082 hartree
cpcmener: -0.02780860 hartree
kineticenergy: 1210.18145750 hartree
xcener: -115.777187287796 hartree
chargesum: 0.0000000
charge: -0.206840 -0.227977 -0.493522 -0.176460 0.102017 -0.293775 -0.148231 0.242786 0.237776 -0.220249 -0.202039 -0.206403 -0.192977 -0.002237 0.124500 -0.192584 -0.291886 -0.293372 -0.232099 -0.126083 0.345285 -0.126180 -0.019058 -0.034153 0.323956 -0.148688 0.081364 0.095567 0.083587 0.087136 0.086975 0.083254 0.087611 0.041192 0.144100 0.076069 0.090983 0.087585 0.091025 0.082270 0.091013 0.140524 0.155343 0.189807 0.174877 0.121738 0.122583 0.115838 0.128053
qa: -0.2068 -0.2280 -0.4935 -0.1765 0.1020 -0.2938 -0.1482 0.2428 0.2378 -0.2202 -0.2020 -0.2064 -0.1930 -0.0022 0.1245 -0.1926 -0.2919 -0.2934 -0.2321 -0.1261 0.3453 -0.1262 -0.0191 -0.0342 0.3240 -0.1487 0.0814 0.0956 0.0836 0.0871 0.0870 0.0833 0.0876 0.0412 0.1441 0.0761 0.0910 0.0876 0.0910 0.0823 0.0910 0.1405 0.1553 0.1898 0.1749 0.1217 0.1226 0.1158 0.1281
va: 1.0695 1.0448 2.0206 3.1905 3.4140 2.9542 4.0930 3.5433 3.5955 3.9449 3.9457 3.7195 3.7004 3.8381 3.7169 3.9681 3.9206 3.9168 4.0102 3.8912 4.1840 3.6125 4.0599 4.0452 4.1643 3.8677 1.0013 0.9987 1.0011 1.0057 1.0326 1.0121 1.0084 1.0163 1.0005 1.0141 1.0062 1.0034 1.0044 1.0033 1.0054 1.0079 0.9903 1.0265 1.0012 0.9970 0.9920 1.0054 0.9864
dispcorr: -0.026240876 hartree
energy: -1215.329167754268
dipole: -26.26332 28.01633 1.75301 6.81770 -6.53757 0.28013 11.44358 -11.31603 0.12755
magnitude: 1.77983 au
magnitude: 4.52396 debye
