program: Gaussian 09
title: 000074431
version: EM64L-G09RevD.01
frameworkgroup: C1[X(C18H23NO)]
method: RPBEPBE
basis: SDD
operation: Freq
keyword: #p
keyword: freq=noraman
keyword: PBEPBE/SDD
title: #p freq=noraman PBEPBE/SDD
converged: YES YES NO NO
title: Mulliken charges:
elementType: O N C C C C C C C C C C C C C C C C C C H H H H H H H H H H H H H H H H H H H H H H H
charge: -0.281290 -0.109838 -0.401407 -0.324915 -0.329155 -0.292970 -0.671179 -0.669725 0.225058 0.187350 0.343878 -0.365607 -0.374248 -0.242674 -0.263225 -0.410477 -0.359549 -0.237764 -0.237256 -0.247014 0.211598 0.225898 0.204912 0.190642 0.206333 0.192741 0.226893 0.203667 0.212378 0.226209 0.208263 0.209242 0.225111 0.208244 0.249107 0.246497 0.225399 0.226609 0.241939 0.250207 0.222496 0.221609 0.226011
chargesum: 0.00000
title: Mulliken charges with hydrogens summed into heavy atoms:
elementType: O N C C C C C C C C C C C C C C C C C C
charge: -0.281290 -0.109838 0.036088 0.070639 0.069920 0.137590 -0.024329 -0.027127 0.225058 0.187350 0.343878 -0.116501 -0.127751 -0.017275 -0.036616 -0.168538 -0.109342 -0.015268 -0.015647 -0.021002
polarizability: 2.40203945e+02 -1.28008361e+01 2.51742026e+02 1.82052625e+01 9.74717283e+00 1.39510501e+02
1716.lowfreq: -0.0009 -0.0008 -0.0007 4.5050 6.1435 8.2885 17.1980 27.6649 39.2901
frequency: 16.6521 27.6419 39.2781 53.3648 71.4537 78.2305 85.1313 94.1190 122.3360 149.2451 173.5731 185.4548 209.7979 224.4257 244.8716 284.7727 294.2999 303.2686 318.5834 353.7961 400.7929 406.6701 435.4019 461.9777 479.9820 501.4493 545.1418 564.8172 582.7277 608.3934 618.9135 701.2342 713.9405 730.6050 746.5399 755.5707 775.6408 792.3146 796.0407 806.7524 819.8775 848.8586 855.1823 915.6800 917.7387 937.3490 968.0631 971.9773 973.5154 987.6337 991.0498 991.3973 994.4970 1036.3914 1055.9449 1062.7248 1063.9558 1075.9098 1082.8098 1084.7311 1094.2094 1121.1210 1123.3071 1163.1174 1171.9018 1175.9611 1195.2033 1208.3276 1211.4045 1237.3598 1262.2401 1279.8585 1288.2581 1289.4258 1291.8028 1320.6514 1328.8346 1362.0953 1365.4854 1371.1922 1373.6400 1387.8995 1388.4959 1393.2849 1422.9562 1443.1756 1461.2829 1462.4660 1467.2956 1470.3996 1474.9878 1480.3033 1485.9502 1487.2907 1491.4411 1500.9999 1577.0292 1589.4998 1603.5351 1611.7711 2856.2630 2864.7923 2912.2933 2963.0704 2982.7995 2984.3307 3021.2258 3031.1562 3034.7219 3065.6713 3075.7707 3077.3968 3091.3921 3091.8372 3119.8238 3127.6477 3129.1097 3138.6121 3142.3245 3157.9115 3158.6031 3171.1044 3178.2908
redmass: 3.4502 3.9163 4.1386 3.5227 3.0287 3.5404 2.0376 3.9140 2.7179 2.6127 2.0322 1.7624 4.2494 1.3963 2.8479 2.0973 2.9317 3.5984 3.4524 3.4487 3.2606 2.9018 3.0777 2.8958 3.0539 3.3701 4.1813 3.4015 6.5337 6.8314 6.3919 1.7563 4.8946 2.5868 3.0423 1.4413 1.9696 1.4000 1.1314 1.9354 1.5898 1.2510 1.4223 1.7801 1.4728 1.3939 6.8108 1.3401 1.4134 4.1048 1.5738 2.0813 6.1902 2.0640 2.0666 2.6179 1.7067 1.8700 1.6340 2.1923 2.8155 1.7730 1.7165 1.4143 1.0518 1.0696 1.1189 2.2691 3.3098 1.6401 2.0150 1.1247 1.2198 1.8874 1.2165 1.3618 1.3410 1.3689 1.7240 2.3729 6.2204 1.2376 1.2438 1.5493 2.3215 2.3780 1.0956 1.0587 1.4351 1.0758 1.3268 1.0829 1.0787 1.0939 1.0803 2.5088 5.8483 6.9150 6.3245 6.0713 1.0719 1.0714 1.0704 1.0573 1.0357 1.0357 1.0877 1.1018 1.0879 1.0948 1.0982 1.0981 1.1004 1.1004 1.0844 1.0871 1.0861 1.0907 1.0935 1.0972 1.0961 1.0984 1.0959
irintensity: 0.0416 0.1152 0.1500 0.1581 0.4945 0.1952 0.2788 2.2284 0.7322 1.9037 0.7918 1.1915 0.2022 0.1226 1.5773 1.1345 0.6474 1.7764 0.6463 0.0667 5.7896 0.4893 1.0143 13.7357 0.6485 5.1506 1.6156 3.4841 10.2657 6.7103 0.6125 51.4434 8.3010 36.8296 8.3262 92.3572 22.7427 4.1449 4.7027 7.7992 5.0906 0.7593 0.3298 0.1427 3.7765 1.4710 105.2851 0.6669 4.6478 2.1928 1.3672 6.3498 6.7066 2.6068 27.1183 28.2387 28.9780 15.1131 10.0008 2.7218 15.7209 39.7635 7.2986 7.9434 0.1753 7.7425 0.6094 23.7325 224.1356 18.8525 31.7214 0.8483 16.2700 3.6356 19.3531 0.3474 3.5417 1.8624 5.1391 6.1878 3.0081 20.2564 19.5310 6.6021 51.2446 5.4619 10.4808 13.6284 46.2846 4.3302 21.9356 15.9229 5.5055 12.7114 8.7469 28.3958 5.5783 12.7326 28.4325 6.6933 31.8109 161.0937 72.4271 48.7875 30.5961 30.8052 19.2224 19.1472 18.7332 32.7161 46.7847 74.5903 28.6996 53.1224 3.4398 5.4828 1.9837 22.8955 22.9179 26.9405 46.2993 17.9990 7.5566
temp: 298.150 k
press: 1.00000 atm
elementType: 8 7 6 6 6 6 6 6 6 6 6 6 6 6 6 6 6 6 6 6 1 1 1 1 1 1 1 1 1 1 1 1 1 1 1 1 1 1 1 1 1 1 1
symmnumber: 1
zpe: 958221.3 jmol-1
zpe.correction: 0.364967 hartree
zpe.thermalcorrener: 0.384995 hartree
zpe.thermalcorrenthalpy: 0.385939 hartree
zpe.thermalcorrgfe: 0.314029 hartree
zpe.sumelectzpe: -828.173880 hartree
zpe.sumelectthermal: -828.153853 hartree
zpe.sumelectthermalent: -828.152908 hartree
zpe.sumelectthermalfe: -828.224818 hartree
dipole: -2.1163 -0.0733 -0.2217
dipole: 2.1291
quadrupole: -109.9054 -111.7657 -122.2679
quadrupole: 1.7392 5.3522 1.2093
quadrupole: 4.7409 2.8806 -7.6216 1.7392 5.3522 1.2093
hfenergy: -828.5388472 hartree
pointgroup: C01 [X(C18H23N1O1)]
dipole: 0.8249551 0.1089615 0.0962047 debye
polarizability: 235.3314701|16.8574142|243.6547312|19.5489469|-34.5498465|152.4702713 unknown
InChI: InChI=1S/C18H23NO/c1-3-19(4-2)14-15-20-18-13-9-8-12-17(18)16-10-6-5-7-11-16/h5-13H,3-4,14-15H2,1-2H3
charge 0 multiplicity 1
43 atoms
O  0.168391 0.212902 -0.026747
N  3.894786 0.052917 0.073004
C  2.490528 -0.417059 0.157817
C  4.835018 -0.967308 -0.461892
C  4.365102 0.689327 1.333906
C  1.536772 0.716684 -0.243812
C  4.679375 -1.187541 -1.978541
C  5.485969 1.722095 1.108188
C  -0.910901 1.038383 -0.383153
C  -2.221109 0.468247 -0.276693
C  -2.475418 -0.930321 0.18349
C  -0.732209 2.365201 -0.847785
C  -3.317869 1.290983 -0.647311
C  -1.848503 3.151071 -1.207376
C  -3.149537 2.614713 -1.107352
C  -3.500078 -1.69897 -0.438491
C  -1.760318 -1.52057 1.262429
C  -3.805421 -3.003968 0.003649
C  -2.069058 -2.823513 1.708431
C  -3.092749 -3.573527 1.083752
H  2.221011 -0.780107 1.176944
H  2.335255 -1.265194 -0.530978
H  5.862353 -0.611932 -0.263028
H  4.727889 -1.943557 0.075501
H  3.500188 1.204319 1.79322
H  4.701022 -0.079098 2.075651
H  1.687253 0.982543 -1.308143
H  1.712202 1.61882 0.377536
H  3.67188 -1.55932 -2.24001
H  4.843407 -0.238899 -2.518713
H  5.412971 -1.933237 -2.337907
H  6.390868 1.261194 0.672694
H  5.141964 2.511513 0.417466
H  5.7785 2.189986 2.066778
H  0.271607 2.789994 -0.935536
H  -4.329391 0.883246 -0.541812
H  -1.695524 4.177117 -1.559899
H  -4.02282 3.219015 -1.373617
H  -4.041724 -1.279689 -1.294373
H  -0.964254 -0.951849 1.749224
H  -4.592254 -3.577789 -0.4993
H  -1.509785 -3.2538 2.547278
H  -3.327487 -4.586526 1.42971
