program: Orca
programVersion: 4.2.1
elementType: F F O N N N C C C C C C C C C C C C C C C C C C C C H H H H H H H H H H H H H H H H H H H H H H H
charge: 0
multiplicity: 1
keywords: wb97x-d3
keywords: def2-TZVPP
keywords: def2/J RIJCOSX GRIDX6 NOFINALGRIDX
keywords: grid4 nofinalgrid
keywords: scfconv7
keywords: smallprint printgap noloewdin
keywords: NOSOSCF
formula: C20H23F2N3O
InChI: InChI=1/C20H23F2N3O/c1-10(2)16-12-7-8-13(16)17-11(12)5-4-6-15(17)23-20(26)14-9-25(3)24-18(14)19(21)22/h4-6,9-10,12-13,16,19,23H,7-8H2,1-3H3
49 atoms
F  -2.794525 0.62475 -2.56796
F  -3.572262 -1.401295 -2.809167
O  -0.780925 0.288824 1.886399
N  -0.721373 1.010982 -0.264974
N  -4.667488 -0.8838 0.940861
N  -4.513578 -1.032436 -0.368107
C  3.345131 -0.713313 -0.056454
C  1.984765 -0.445807 0.634984
C  3.982027 0.590757 0.480374
C  2.418566 -0.280483 2.114083
C  3.79049 0.425813 2.006934
C  1.706298 0.941657 0.122305
C  2.94744 1.584315 0.029963
C  4.051977 -2.025222 0.276429
C  0.553101 1.613137 -0.248156
C  3.062219 2.884389 -0.417581
C  5.436873 -2.061845 -0.362136
C  3.219098 -3.216074 -0.187428
C  0.66657 2.927408 -0.715506
C  1.899581 3.551197 -0.801415
C  -1.307893 0.391823 0.792158
C  -2.651181 -0.153845 0.538535
C  -3.301972 -0.594462 -0.634981
C  -3.583385 -0.3747 1.531714
C  -2.777377 -0.638432 -2.027584
C  -5.907478 -1.264109 1.580984
H  3.232904 -0.658581 -1.146321
H  1.198132 -1.179898 0.472503
H  5.002136 0.815997 0.171528
H  2.505646 -1.254298 2.599288
H  1.689462 0.293542 2.681637
H  3.813296 1.386966 2.521676
H  4.591631 -0.180583 2.433558
H  4.18245 -2.11347 1.359576
H  4.026752 3.371425 -0.492131
H  6.083518 -1.266041 0.011416
H  5.940979 -3.008042 -0.155506
H  5.375285 -1.953515 -1.448137
H  2.248115 -3.255789 0.308972
H  3.037556 -3.177977 -1.264744
H  3.727503 -4.158319 0.026099
H  -0.225712 3.460798 -1.021981
H  1.954268 4.565779 -1.174639
H  -1.328149 1.32012 -1.008635
H  -3.539033 -0.191811 2.593377
H  -1.754837 -1.012523 -2.092531
H  -5.730824 -2.04523 2.317325
H  -6.359944 -0.404257 2.070222
H  -6.584965 -1.637765 0.820069
elementType: F O N C H
totalener: -1215.30025772 hartree
nucrepener: 2393.46651453 hartree
electener: -3608.76677225 hartree
oneelecener: -6415.69289652 hartree
twoeener: 2806.92612427 hartree
cpcmener: -0.02943329 hartree
kineticenergy: 1210.17126816 hartree
xcener: -115.776423238310 hartree
chargesum: -0.0000000
charge: -0.220057 -0.202308 -0.486990 -0.208076 0.113749 -0.306967 -0.056308 0.225008 0.229182 -0.232225 -0.212449 -0.211000 -0.192398 -0.025434 0.080920 -0.208598 -0.295074 -0.295518 -0.212915 -0.125370 0.371983 -0.104908 0.018342 -0.041316 0.244915 -0.155205 0.080483 0.104550 0.086714 0.090398 0.090593 0.086084 0.090463 0.047125 0.143102 0.091369 0.091041 0.085934 0.090430 0.085259 0.092070 0.137292 0.156087 0.187352 0.178319 0.124821 0.128584 0.127946 0.112999
qa: -0.2201 -0.2023 -0.4870 -0.2081 0.1137 -0.3070 -0.0563 0.2250 0.2292 -0.2322 -0.2124 -0.2110 -0.1924 -0.0254 0.0809 -0.2086 -0.2951 -0.2955 -0.2129 -0.1254 0.3720 -0.1049 0.0183 -0.0413 0.2449 -0.1552 0.0805 0.1046 0.0867 0.0904 0.0906 0.0861 0.0905 0.0471 0.1431 0.0914 0.0910 0.0859 0.0904 0.0853 0.0921 0.1373 0.1561 0.1874 0.1783 0.1248 0.1286 0.1279 0.1130
va: 1.0312 1.0814 2.0276 3.2059 3.4088 2.9567 4.0607 3.6646 3.6886 3.8976 3.9044 3.8681 3.8147 3.8390 3.7737 3.9744 3.9226 3.9206 3.9819 3.8938 4.1390 3.5504 3.9024 4.0351 4.2275 3.8658 1.0159 0.9972 1.0008 1.0054 1.0353 1.0142 1.0082 1.0110 1.0026 1.0039 1.0053 1.0027 1.0050 1.0030 1.0056 1.0075 0.9909 1.0218 0.9995 0.9813 0.9875 0.9881 1.0087
dispcorr: -0.025045184 hartree
energy: -1215.325302900496
dipole: 37.10282 -37.59972 -0.49689 -10.94531 10.66799 -0.27732 14.99819 -14.20592 0.79228
magnitude: 0.97545 au
magnitude: 2.47941 debye
