program: Orca
programVersion: 4.2.1
elementType: F F O N N N C C C C C C C C C C C C C C C C C C C C H H H H H H H H H H H H H H H H H H H H H H H
charge: 0
multiplicity: 1
keywords: wb97x-d3
keywords: def2-TZVPP
keywords: def2/J RIJCOSX GRIDX6 NOFINALGRIDX
keywords: grid4 nofinalgrid
keywords: scfconv7
keywords: smallprint printgap noloewdin
keywords: NOSOSCF
formula: C20H23F2N3O
InChI: InChI=1/C20H23F2N3O/c1-10(2)16-12-7-8-13(16)17-11(12)5-4-6-15(17)23-20(26)14-9-25(3)24-18(14)19(21)22/h4-6,9-10,12-13,16,19,23H,7-8H2,1-3H3
49 atoms
F  -3.240063 -3.081624 -0.025777
F  -1.545145 -2.431651 -1.246283
O  -2.195241 0.282729 -2.664142
N  -0.656766 1.685739 -1.811804
N  -2.685839 0.395218 1.761317
N  -2.989862 -0.820583 1.318117
C  2.844327 -0.430217 -0.248094
C  1.301662 -0.321701 -0.340704
C  2.91845 0.3961 1.061182
C  0.877534 -0.90878 1.029417
C  1.982232 -0.412204 1.990721
C  1.150653 1.171354 -0.240613
C  2.144337 1.614859 0.639309
C  3.444815 -1.833974 -0.222801
C  0.291437 2.078442 -0.836535
C  2.278719 2.951514 0.954744
C  4.95969 -1.759269 -0.061319
C  3.079422 -2.599182 -1.490416
C  0.434488 3.434938 -0.532045
C  1.41139 3.86352 0.352599
C  -1.64233 0.769135 -1.686248
C  -2.070489 0.400963 -0.330706
C  -2.630591 -0.832399 0.054062
C  -2.129406 1.163564 0.817669
C  -2.773732 -2.05694 -0.781549
C  -3.005113 0.779576 3.117621
H  3.311281 0.121228 -1.073312
H  0.819933 -0.789295 -1.19782
H  3.907123 0.594911 1.473133
H  0.843121 -1.99813 0.98149
H  -0.11363 -0.576195 1.327566
H  1.591446 0.202864 2.802142
H  2.517863 -1.242622 2.453868
H  3.046325 -2.393575 0.629132
H  3.050358 3.294809 1.633126
H  5.403665 -2.756569 -0.048054
H  5.418165 -1.206832 -0.885597
H  5.250735 -1.265438 0.867486
H  3.542905 -3.587604 -1.499101
H  2.002765 -2.750215 -1.583547
H  3.417103 -2.070783 -2.385768
H  -0.22365 4.155036 -1.002642
H  1.505743 4.920196 0.567856
H  -0.48354 1.999142 -2.758242
H  -1.835857 2.181547 1.016857
H  -3.433755 -1.928689 -1.638094
H  -2.16273 1.299946 3.565773
H  -3.879492 1.427314 3.139081
H  -3.211349 -0.118108 3.691278
elementType: F O N C H
totalener: -1215.29742009 hartree
nucrepener: 2524.39844456 hartree
electener: -3739.69586465 hartree
oneelecener: -6677.31074481 hartree
twoeener: 2937.61488016 hartree
cpcmener: -0.03193633 hartree
kineticenergy: 1210.18576699 hartree
xcener: -115.782401021278 hartree
chargesum: 0.0000000
charge: -0.212395 -0.213489 -0.492695 -0.151856 0.118723 -0.297976 -0.080802 0.340432 0.226868 -0.246886 -0.213782 -0.192335 -0.207075 -0.022601 -0.058478 -0.187059 -0.292118 -0.299299 -0.192615 -0.116391 0.299642 -0.117527 -0.025504 -0.022866 0.307033 -0.152654 0.084317 0.110967 0.089828 0.094720 0.084490 0.083946 0.092924 0.047921 0.144282 0.092800 0.084021 0.090506 0.094443 0.088694 0.088114 0.143847 0.156638 0.174960 0.178345 0.110510 0.121763 0.129756 0.115916
qa: -0.2124 -0.2135 -0.4927 -0.1519 0.1187 -0.2980 -0.0808 0.3404 0.2269 -0.2469 -0.2138 -0.1923 -0.2071 -0.0226 -0.0585 -0.1871 -0.2921 -0.2993 -0.1926 -0.1164 0.2996 -0.1175 -0.0255 -0.0229 0.3070 -0.1527 0.0843 0.1110 0.0898 0.0947 0.0845 0.0839 0.0929 0.0479 0.1443 0.0928 0.0840 0.0905 0.0944 0.0887 0.0881 0.1438 0.1566 0.1750 0.1783 0.1105 0.1218 0.1298 0.1159
va: 1.0657 1.0449 2.0234 3.1699 3.3754 2.9241 4.1072 3.5180 3.7087 3.9395 3.9241 3.7200 3.8571 3.8313 3.7395 3.9578 3.9208 3.9192 3.9520 3.8721 4.2917 3.4851 3.9407 3.9741 4.2110 3.8665 1.0140 0.9929 1.0001 1.0141 1.0161 1.0142 1.0092 1.0113 1.0019 1.0047 1.0035 1.0050 1.0047 1.0077 1.0028 1.0081 0.9890 1.0144 0.9924 0.9918 0.9916 0.9863 1.0075
dispcorr: -0.029137390 hartree
energy: -1215.326557481877
dipole: 33.08799 -31.86086 1.22713 2.53084 -0.00456 2.52628 10.59356 -8.54525 2.04831
magnitude: 3.47614 au
magnitude: 8.83565 debye
