program: Orca
programVersion: 4.2.1
elementType: Cl F F F O N N N C C C C C C C C C C C C C C C C C C C H H H H H H H H H H H H H H H H H H H H H
charge: 0
multiplicity: 1
keywords: wb97x-d3
keywords: def2-TZVPP
keywords: def2/J RIJCOSX GRIDX6 NOFINALGRIDX
keywords: grid4 nofinalgrid
keywords: scfconv7
keywords: smallprint printgap noloewdin
keywords: NOSOSCF
formula: C19H21ClF3N3O
InChI: InChI=1/C19H21ClF3N3O/c1-10(2)14-7-4-12(20)8-11(14)9-26(13-5-6-13)19(27)15-16(17(21)22)24-25(3)18(15)23/h4,7-8,10,13,17H,5-6,9H2,1-3H3
48 atoms
Cl 5.555483 -1.411004 0.644263
F  -3.773393 -2.312854 -1.047158
F  -2.045415 2.485282 0.472284
F  -0.955317 1.289425 1.927689
O  -1.621836 0.162621 -2.229452
N  -0.183201 -0.74841 -0.731581
N  -4.431025 -1.053254 0.767029
N  -4.022883 -0.00899 1.479849
C  0.027178 -1.452617 0.501743
C  -0.719507 -2.714188 0.797755
C  0.736435 -2.771125 0.478334
C  0.976091 -0.53389 -1.59385
C  -1.399321 -0.317697 -1.12836
C  2.154408 0.064727 -0.861105
C  2.248216 1.433921 -0.570147
C  -2.515389 -0.441113 -0.150486
C  1.208755 2.424926 -1.049704
C  3.183459 -0.793832 -0.486227
C  -2.879469 0.367032 0.944923
C  3.380301 1.88345 0.105898
C  -3.5633 -1.315011 -0.215806
C  4.292654 -0.313646 0.186196
C  1.022095 3.616977 -0.117066
C  1.568764 2.903648 -2.458424
C  4.400914 1.029442 0.493432
C  -2.208149 1.575842 1.475052
C  -5.656652 -1.756985 1.071024
H  0.253897 -0.821429 1.351915
H  -1.39267 -3.100825 0.044608
H  -1.050369 -2.868247 1.816465
H  1.44851 -2.961057 1.270653
H  1.01007 -3.193737 -0.480208
H  0.667449 0.095858 -2.425107
H  1.278648 -1.487016 -2.033294
H  0.244736 1.918579 -1.108432
H  3.117851 -1.846295 -0.729623
H  3.487338 2.933964 0.342079
H  0.182732 4.225412 -0.455184
H  0.814306 3.305407 0.906281
H  1.895778 4.270575 -0.098843
H  0.800801 3.575011 -2.84723
H  2.516837 3.445969 -2.457459
H  1.667271 2.075618 -3.16239
H  5.264774 1.414665 1.018182
H  -2.775535 2.037625 2.283853
H  -5.452426 -2.794407 1.327659
H  -6.11641 -1.266897 1.923046
H  -6.343229 -1.718122 0.228059
elementType: Cl F O N C H
totalener: -1736.00981910 hartree
nucrepener: 2838.52707935 hartree
electener: -4574.53689845 hartree
oneelecener: -8026.93500454 hartree
twoeener: 3452.39810609 hartree
cpcmener: -0.02910215 hartree
kineticenergy: 1730.16091754 hartree
xcener: -140.077689200381 hartree
chargesum: -0.0000000
charge: -0.102568 -0.183458 -0.222294 -0.223020 -0.480612 -0.017272 0.097867 -0.285817 -0.069949 -0.154997 -0.173590 -0.109129 0.244142 -0.026891 -0.020875 -0.135755 0.058688 -0.107317 0.018037 -0.156699 0.287192 0.079513 -0.308319 -0.288708 -0.181857 0.342510 -0.165990 0.103095 0.097290 0.097383 0.103094 0.104347 0.129942 0.129097 0.025170 0.121577 0.145927 0.100201 0.102277 0.092662 0.099732 0.094957 0.091808 0.141633 0.131402 0.130591 0.114373 0.130607
qa: -0.1026 -0.1835 -0.2223 -0.2230 -0.4806 -0.0173 0.0979 -0.2858 -0.0699 -0.1550 -0.1736 -0.1091 0.2441 -0.0269 -0.0209 -0.1358 0.0587 -0.1073 0.0180 -0.1567 0.2872 0.0795 -0.3083 -0.2887 -0.1819 0.3425 -0.1660 0.1031 0.0973 0.0974 0.1031 0.1043 0.1299 0.1291 0.0252 0.1216 0.1459 0.1002 0.1023 0.0927 0.0997 0.0950 0.0918 0.1416 0.1314 0.1306 0.1144 0.1306
va: 1.2060 1.1305 1.0604 1.0592 2.0125 3.0554 3.3409 2.9748 3.7955 3.9085 3.9129 3.7963 4.2046 3.5724 3.6969 3.6056 3.8611 3.9703 4.0613 3.9196 4.1379 3.8636 3.9135 3.9276 4.0529 4.1147 3.8796 1.0223 1.0185 1.0244 1.0160 1.0151 1.0393 0.9979 1.0229 1.0157 0.9948 1.0046 1.0129 1.0052 1.0028 1.0024 1.0041 1.0064 0.9885 0.9870 1.0079 0.9870
dispcorr: -0.029598178 hartree
energy: -1736.039417280711
dipole: 0.25169 -1.53351 -1.28182 7.44211 -8.78182 -1.33971 -5.21828 6.55549 1.33721
magnitude: 2.28605 au
magnitude: 5.81068 debye
