program: Gaussian 09
title: 000074352
version: EM64L-G09RevD.01
frameworkgroup: C1[X(C14H22O2)]
method: RPBEPBE
basis: SDD
operation: Freq
keyword: #pfreq=noraman
keyword: PBEPBE/SDD
title: #p freq=noraman PBEPBE/SDD
converged: YES YES NO NO
title: Mulliken charges:
elementType: O O C C C C C C C C C C C C C C H H H H H H H H H H H H H H H H H H H H H H
charge: -0.423917 -0.442207 -0.382900 -0.360849 -0.372454 -0.398310 -0.352758 -0.618128 -0.356805 0.467635 -0.695554 0.056731 -0.594794 0.289882 -0.328902 -0.349863 0.196237 0.194312 0.188300 0.196600 0.189386 0.190321 0.215752 0.222195 0.188784 0.188840 0.232472 0.203107 0.194922 0.194922 0.210245 0.215767 0.209953 0.225065 0.248834 0.252433 0.355252 0.349495
chargesum: 0.00000
title: Mulliken charges with hydrogens summed into heavy atoms:
elementType: O O C C C C C C C C C C C C C C
charge: -0.068665 -0.092712 0.007649 0.024051 0.007253 0.039637 0.024866 -0.182549 0.033040 0.467635 -0.059590 0.056731 -0.369729 0.289882 -0.080068 -0.097430
polarizability: 2.09399205e+02 9.71315018e+00 1.53593796e+02 1.86845028e+01 -6.41087848e+00 1.16334737e+02
1716.lowfreq: -21.5564 -1.2431 -0.0006 0.0002 0.0003 4.5232 17.7086 21.2187 34.8796
frequency: 9.9758 19.6382 34.8685 52.8777 83.8188 86.0773 103.8839 136.2704 139.1400 152.2247 165.4325 193.8740 236.7572 262.6121 281.2986 298.7222 310.9895 315.9921 345.4514 368.5068 421.1459 449.4131 452.7171 480.7716 484.4137 572.6859 624.9023 713.3562 719.9348 724.8082 732.7107 742.4729 755.2432 787.0963 822.0218 843.8269 855.8588 889.3411 926.4299 937.1318 943.8555 984.0039 1002.0464 1012.9514 1039.9901 1056.1040 1060.6447 1078.4277 1080.3975 1104.9345 1119.0750 1130.1612 1146.6004 1169.7245 1184.5432 1208.9258 1214.1298 1222.7942 1254.5067 1256.5937 1279.1982 1281.3158 1287.8782 1291.5393 1295.8140 1299.9153 1305.4908 1326.3184 1345.9044 1355.3401 1356.4076 1390.9487 1401.1247 1439.8721 1460.1752 1460.4999 1464.9946 1469.9203 1475.5661 1478.7428 1481.3899 1487.0114 1491.3967 1497.1291 1613.9920 1630.1021 2933.3178 2948.1280 2950.5154 2952.9156 2960.0051 2967.3744 2972.3073 2972.5545 2983.5632 2989.8641 3001.6727 3014.9873 3023.1666 3036.0207 3046.3554 3069.0051 3070.8706 3102.3637 3159.3388 3180.5065 3585.5414 3586.6633
redmass: 1.6583 4.3570 4.1087 3.7187 2.2949 2.2243 2.7429 2.3557 2.2749 2.7871 3.7841 4.8607 1.1173 1.2321 2.7258 2.9402 1.1211 4.3245 4.3450 4.3871 3.4484 4.3974 3.5371 2.9932 3.5787 3.7048 4.8268 4.4366 1.0646 1.1677 2.2083 1.7398 2.3272 1.2759 1.4721 1.5128 1.3130 1.9088 1.5622 2.3394 1.3615 4.6110 1.2369 3.5081 3.1017 2.4856 1.6933 2.3619 2.2001 1.3832 2.5504 1.6504 1.4400 1.5741 1.7752 1.6060 1.2738 1.5331 1.3069 1.3211 1.1608 1.0839 1.4754 1.1207 1.1506 1.3729 1.9818 1.5326 1.4957 1.6403 1.6033 1.2169 5.3127 3.0063 1.0756 1.0750 1.0712 1.0960 1.1222 1.0422 1.1185 1.1022 1.6016 1.5279 6.4236 6.9510 1.0683 1.0592 1.0590 1.0591 1.0592 1.0587 1.0411 1.0576 1.0961 1.0978 1.1008 1.0976 1.1001 1.1034 1.1025 1.1007 1.0993 1.0911 1.0882 1.0976 1.0658 1.0658
irintensity: 0.0469 0.2868 0.9642 0.2675 0.4984 0.9872 0.8931 0.6488 0.3056 0.0242 0.1193 1.8927 0.0007 102.4485 11.2347 2.9099 158.7674 0.1167 0.4557 1.5024 4.8324 6.1071 8.0231 10.4390 22.7683 3.5413 3.4402 20.6473 11.7618 1.9080 14.8753 5.3833 10.3129 1.7754 30.8058 32.1913 4.8675 5.6464 2.5542 6.2062 0.2818 1.2451 1.2748 2.0150 0.4328 1.5394 6.7502 0.6121 0.2577 2.4671 26.0389 189.7472 115.3855 93.4224 0.7493 13.4483 12.0773 8.2959 0.6209 1.6944 0.8800 0.3658 1.4360 4.7928 1.3547 41.9441 1.7447 1.1574 0.3515 0.8896 0.2092 11.2741 8.2007 65.4585 0.0752 0.0244 0.2076 1.8575 1.5594 12.6790 5.5232 12.8279 76.7343 64.4255 0.5158 15.2583 27.6666 9.4206 3.8000 0.0674 25.6092 108.4231 27.0745 80.5308 2.2818 3.1337 2.3018 5.0361 3.1499 46.3494 138.4203 92.2150 55.6545 17.9928 4.5849 6.3562 50.2900 5.3351
temp: 298.150 k
press: 1.00000 atm
elementType: 8 8 6 6 6 6 6 6 6 6 6 6 6 6 6 6 1 1 1 1 1 1 1 1 1 1 1 1 1 1 1 1 1 1 1 1 1 1
symmnumber: 1
zpe: 861192.4 jmol-1
zpe.correction: 0.328011 hartree
zpe.thermalcorrener: 0.346483 hartree
zpe.thermalcorrenthalpy: 0.347428 hartree
zpe.thermalcorrgfe: 0.278223 hartree
zpe.sumelectzpe: -695.879057 hartree
zpe.sumelectthermal: -695.860585 hartree
zpe.sumelectthermalent: -695.859640 hartree
zpe.sumelectthermalfe: -695.928845 hartree
dipole: 2.9635 -1.8587 1.5886
dipole: 3.8420
quadrupole: -114.3414 -94.4322 -100.8407
quadrupole: 5.2383 -1.8744 -1.9310
quadrupole: -11.1366 8.7725 2.3641 5.2383 -1.8744 -1.9310
hfenergy: -696.2070679 hartree
pointgroup: C01 [X(C14H22O2)]
dipole: 1.1798203 -0.578041 0.7474599 debye
polarizability: 209.1256402|14.038229|150.2531008|16.1961084|-12.7652192|119.948997 unknown
InChI: InChI=1S/C14H22O2/c1-2-3-4-5-6-7-8-12-11-13(15)9-10-14(12)16/h9-11,15-16H,2-8H2,1H3
charge 0 multiplicity 1
38 atoms
O  -2.036314 2.406513 -0.379563
O  -5.168519 -2.264263 -0.039026
C  2.832901 -0.119256 -0.180841
C  1.664453 0.061814 0.814275
C  4.224301 -0.005271 0.482009
C  0.27712 -0.04402 0.144296
C  5.391691 -0.17428 -0.516676
C  -0.89633 0.131718 1.151913
C  6.784455 -0.057584 0.143765
C  -2.266367 0.087401 0.491495
C  7.943856 -0.220371 -0.863176
C  -2.760334 1.199043 -0.245475
C  -3.075781 -1.073796 0.562572
C  -4.331384 -1.128404 -0.083994
C  -4.016299 1.147427 -0.889693
C  -4.805546 -0.01508 -0.814018
H  2.74246 -1.108591 -0.675883
H  2.748395 0.639307 -0.986931
H  1.761724 1.048821 1.314984
H  1.744599 -0.701338 1.616651
H  4.312379 0.981858 0.98281
H  4.313775 -0.768947 1.282924
H  0.199212 0.706183 -0.668999
H  0.174608 -1.031873 -0.346365
H  5.302517 0.589068 -1.317874
H  5.306721 -1.161287 -1.018003
H  -0.827304 -0.667892 1.913257
H  -0.753556 1.083146 1.71187
H  6.866985 0.927189 0.647756
H  6.874851 -0.823079 0.941476
H  7.893942 0.553789 -1.652072
H  8.928014 -0.13419 -0.366812
H  7.901124 -1.207952 -1.360359
H  -2.71035 -1.939556 1.132606
H  -4.359977 2.026081 -1.443362
H  -5.780204 -0.073668 -1.306411
H  -1.194536 2.366969 0.137751
H  -4.752881 -2.982629 0.498726
