program: Orca
programVersion: 4.2.1
elementType: F F F F F O N N N C C C C C C C C C C C C C C C C C C H H H H H H H H H H H H
charge: 0
multiplicity: 1
keywords: wb97x-d3
keywords: def2-TZVPP
keywords: def2/J RIJCOSX GRIDX6 NOFINALGRIDX
keywords: grid4 nofinalgrid
keywords: scfconv7
keywords: smallprint printgap noloewdin
keywords: NOSOSCF
formula: C18H12F5N3O
InChI: InChI=1/C18H12F5N3O/c1-26-8-11(16(25-26)17(22)23)18(27)24-14-5-3-2-4-10(14)9-6-12(19)15(21)13(20)7-9/h2-8,17,24H,1H3
39 atoms
F  3.684148 -1.684589 -1.664963
F  2.423321 -0.39531 -2.885773
F  -1.831473 2.908667 -1.021998
F  -3.545732 1.32558 3.014854
F  -2.984613 3.379898 1.364859
O  0.645556 -0.866359 1.530657
N  0.581596 -1.306523 -0.680293
N  3.504757 1.971363 0.579791
N  3.955692 1.453546 -0.554025
C  -1.746347 -1.857336 -0.147747
C  -0.482407 -2.234869 -0.61261
C  2.176468 0.28192 0.17654
C  -2.053772 -0.468683 0.251243
C  3.167799 0.432498 -0.82042
C  1.081995 -0.676757 0.404209
C  2.451327 1.304494 1.060689
C  -2.745275 -2.82726 -0.082693
C  -0.250249 -3.538606 -1.031341
C  -2.659069 -0.223697 1.480423
C  -1.772492 0.593617 -0.604648
C  -2.512248 -4.128298 -0.499595
C  3.483072 -0.385172 -2.015053
C  -1.263434 -4.483293 -0.987515
C  4.117395 3.150828 1.153744
C  -2.087501 1.87696 -0.215574
C  -2.968452 1.070044 1.83962
C  -2.68439 2.133575 1.004482
H  0.951645 -1.099403 -1.59578
H  1.961565 1.598323 1.974594
H  -3.729151 -2.550071 0.274028
H  0.735349 -3.813626 -1.384147
H  -2.877769 -1.031163 2.166673
H  -1.330896 0.433144 -1.578582
H  4.357856 -0.015177 -2.548006
H  -3.308894 -4.858351 -0.452287
H  -1.071269 -5.493881 -1.321097
H  4.321623 2.985853 2.208307
H  5.051702 3.342593 0.636753
H  3.463738 4.01329 1.044049
elementType: F O N C H
totalener: -1431.99971093 hartree
nucrepener: 2515.40749403 hartree
electener: -3947.40720496 hartree
oneelecener: -6967.23712941 hartree
twoeener: 3019.82992445 hartree
cpcmener: -0.03655698 hartree
kineticenergy: 1426.68815067 hartree
xcener: -128.433604524862 hartree
chargesum: 0.0000000
charge: -0.216769 -0.228625 -0.205417 -0.206138 -0.199926 -0.510522 -0.225248 0.103835 -0.297136 0.100801 0.143165 -0.122343 0.071063 -0.019494 0.355079 -0.029634 -0.165544 -0.205502 -0.241994 -0.222267 -0.156480 0.330527 -0.133652 -0.150749 0.237991 0.239962 0.156126 0.219181 0.176531 0.149671 0.142764 0.144958 0.139583 0.127529 0.162837 0.164341 0.128191 0.113660 0.129642
qa: -0.2168 -0.2286 -0.2054 -0.2061 -0.1999 -0.5105 -0.2252 0.1038 -0.2971 0.1008 0.1432 -0.1223 0.0711 -0.0195 0.3551 -0.0296 -0.1655 -0.2055 -0.2420 -0.2223 -0.1565 0.3305 -0.1337 -0.1507 0.2380 0.2400 0.1561 0.2192 0.1765 0.1497 0.1428 0.1450 0.1396 0.1275 0.1628 0.1643 0.1282 0.1137 0.1296
va: 1.0579 1.0488 1.0837 1.0832 1.0935 2.0049 3.1370 3.4195 2.9596 3.5628 3.6423 3.5937 3.3766 4.0566 4.1910 4.0389 3.8868 4.0377 3.9344 3.8660 3.9044 4.1596 3.9106 3.8652 3.9051 3.9183 3.9538 1.0078 1.0009 1.0013 1.0135 1.0080 1.0133 0.9966 0.9897 0.9883 0.9894 1.0069 0.9870
dispcorr: -0.019919243 hartree
energy: -1432.019630167745
dipole: 10.00667 -8.95269 1.05398 -11.12083 11.38434 0.26351 0.64865 -1.38380 -0.73515
magnitude: 1.31177 au
magnitude: 3.33425 debye
