program: Orca
programVersion: 4.2.1
elementType: F F F F F O N N N C C C C C C C C C C C C C C C C C C H H H H H H H H H H H H
charge: 0
multiplicity: 1
keywords: wb97x-d3
keywords: def2-TZVPP
keywords: def2/J RIJCOSX GRIDX6 NOFINALGRIDX
keywords: grid4 nofinalgrid
keywords: scfconv7
keywords: smallprint printgap noloewdin
keywords: NOSOSCF
formula: C18H12F5N3O
InChI: InChI=1/C18H12F5N3O/c1-26-8-11(16(25-26)17(22)23)18(27)24-14-5-3-2-4-10(14)9-6-12(19)15(21)13(20)7-9/h2-8,17,24H,1H3
39 atoms
F  0.536029 1.643611 -1.066566
F  0.483793 1.586619 1.109851
F  -2.622877 1.887869 -2.518594
F  -3.036267 2.083834 2.119807
F  -3.230041 3.26385 -0.289626
O  2.679822 -2.518512 0.097446
N  0.714873 -1.386901 0.018326
N  4.641721 1.038806 0.046367
N  3.642154 1.909326 0.054653
C  -1.58108 -2.063489 0.084167
C  -0.223335 -2.427037 0.085003
C  2.830031 -0.194869 0.044168
C  -2.003604 -0.643293 -0.014278
C  2.537668 1.193234 0.052994
C  2.068924 -1.459357 0.054127
C  4.21283 -0.223669 0.041318
C  -2.559712 -3.043379 0.178655
C  0.110543 -3.780562 0.163421
C  -2.317359 0.067389 1.139804
C  -2.102527 -0.033734 -1.261388
C  -2.225056 -4.385511 0.264219
C  1.262921 1.948166 0.049357
C  -0.886893 -4.740984 0.251346
C  6.01914 1.486283 0.048126
C  -2.51641 1.278857 -1.337811
C  -2.728042 1.378674 1.031335
C  -2.832409 1.996871 -0.200337
H  0.304542 -0.469294 -0.029295
H  4.900253 -1.05311 0.035569
H  -3.599502 -2.742735 0.181109
H  1.137983 -4.099523 0.159369
H  -2.239354 -0.39168 2.116187
H  -1.860625 -0.572536 -2.167825
H  1.423428 3.025398 0.080242
H  -2.998949 -5.137153 0.336516
H  -0.601131 -5.782737 0.311853
H  6.028947 2.570982 0.049095
H  6.531655 1.122646 0.935116
H  6.533396 1.124754 -0.838714
elementType: F O N C H
totalener: -1431.99838370 hartree
nucrepener: 2546.60999905 hartree
electener: -3978.60838275 hartree
oneelecener: -7029.25453263 hartree
twoeener: 3050.64614989 hartree
cpcmener: -0.03069714 hartree
kineticenergy: 1426.67613115 hartree
xcener: -128.433974127786 hartree
chargesum: 0.0000000
charge: -0.228232 -0.227051 -0.204139 -0.203590 -0.198278 -0.528624 -0.155611 0.106476 -0.299140 0.091201 0.146903 -0.128554 -0.099681 -0.027729 0.429214 -0.019024 -0.139045 -0.206283 -0.185310 -0.192903 -0.187225 0.348830 -0.155637 -0.152112 0.248900 0.244167 0.163271 0.169686 0.172226 0.142862 0.161496 0.143649 0.146082 0.126808 0.161195 0.162050 0.112886 0.130222 0.130045
qa: -0.2282 -0.2271 -0.2041 -0.2036 -0.1983 -0.5286 -0.1556 0.1065 -0.2991 0.0912 0.1469 -0.1286 -0.0997 -0.0277 0.4292 -0.0190 -0.1390 -0.2063 -0.1853 -0.1929 -0.1872 0.3488 -0.1556 -0.1521 0.2489 0.2442 0.1633 0.1697 0.1722 0.1429 0.1615 0.1436 0.1461 0.1268 0.1612 0.1620 0.1129 0.1302 0.1300
va: 1.0521 1.0536 1.0864 1.0876 1.0958 1.9785 3.2823 3.4259 2.9691 3.4258 3.8224 3.5777 3.5903 4.0921 4.1093 4.0410 3.8970 3.9464 3.8977 3.8830 3.9178 4.1293 3.9345 3.8625 3.8799 3.8985 3.9503 1.0371 1.0072 1.0045 1.0401 1.0108 1.0087 0.9932 0.9906 0.9902 1.0077 0.9878 0.9879
dispcorr: -0.020770229 hartree
energy: -1432.019153928534
dipole: 21.98152 -20.22603 1.75549 -21.43331 21.43824 0.00492 1.69238 -1.61512 0.07726
magnitude: 1.75720 au
magnitude: 4.46645 debye
