program: Orca
programVersion: 4.2.1
elementType: F F F F F O N N N C C C C C C C C C C C C C C C C C C H H H H H H H H H H H H
charge: 0
multiplicity: 1
keywords: wb97x-d3
keywords: def2-TZVPP
keywords: def2/J RIJCOSX GRIDX6 NOFINALGRIDX
keywords: grid4 nofinalgrid
keywords: scfconv7
keywords: smallprint printgap noloewdin
keywords: NOSOSCF
formula: C18H12F5N3O
InChI: InChI=1/C18H12F5N3O/c1-26-8-11(16(25-26)17(22)23)18(27)24-14-5-3-2-4-10(14)9-6-12(19)15(21)13(20)7-9/h2-8,17,24H,1H3
39 atoms
F  2.597707 -0.647851 -2.686826
F  1.172912 0.996303 -2.550318
F  -1.646543 2.668198 -1.369647
F  -3.482515 1.468655 2.746194
F  -2.854273 3.362506 0.935266
O  0.59869 -0.818633 1.648164
N  0.734844 -1.512219 -0.496433
N  3.794552 1.644068 0.79455
N  3.724822 1.663266 -0.52949
C  -1.626122 -1.997548 -0.069536
C  -0.340059 -2.42048 -0.425805
C  2.20735 0.22251 0.302124
C  -1.941149 -0.578614 0.194995
C  2.777171 0.807844 -0.853099
C  1.119867 -0.73666 0.545238
C  2.904329 0.811224 1.3385
C  -2.639966 -2.949932 0.010242
C  -0.105782 -3.754633 -0.737217
C  -2.576047 -0.219863 1.380216
C  -1.626176 0.399416 -0.744684
C  -2.404167 -4.280974 -0.296001
C  2.466357 0.658849 -2.294807
C  -1.134868 -4.681238 -0.686293
C  4.704731 2.520773 1.499096
C  -1.934887 1.715829 -0.48101
C  -2.87892 1.103857 1.613374
C  -2.560477 2.085835 0.694884
H  1.341607 -1.592089 -1.297183
H  2.822554 0.678036 2.404986
H  -3.637694 -2.634013 0.287688
H  0.893664 -4.06739 -1.012193
H  -2.819373 -0.959711 2.131387
H  -1.156562 0.143458 -1.683319
H  3.121294 1.267637 -2.916681
H  -3.212106 -4.997882 -0.241292
H  -0.938764 -5.715029 -0.936606
H  5.106821 2.005795 2.367402
H  5.521492 2.787192 0.835459
H  4.192679 3.425509 1.821598
elementType: F O N C H
totalener: -1432.00037670 hartree
nucrepener: 2548.82547202 hartree
electener: -3980.82584872 hartree
oneelecener: -7034.63194300 hartree
twoeener: 3053.80609428 hartree
cpcmener: -0.03584375 hartree
kineticenergy: 1426.68918269 hartree
xcener: -128.434543890867 hartree
chargesum: -0.0000000
charge: -0.228847 -0.212757 -0.205471 -0.206790 -0.200512 -0.506531 -0.196018 0.102568 -0.294567 0.080352 0.127235 -0.137364 0.073159 -0.019108 0.360191 -0.022192 -0.162327 -0.205914 -0.241384 -0.197036 -0.165497 0.331286 -0.133989 -0.145200 0.228630 0.239408 0.161941 0.203052 0.173927 0.149654 0.147869 0.143609 0.138182 0.125842 0.162568 0.163229 0.123365 0.116030 0.129405
qa: -0.2288 -0.2128 -0.2055 -0.2068 -0.2005 -0.5065 -0.1960 0.1026 -0.2946 0.0804 0.1272 -0.1374 0.0732 -0.0191 0.3602 -0.0222 -0.1623 -0.2059 -0.2414 -0.1970 -0.1655 0.3313 -0.1340 -0.1452 0.2286 0.2394 0.1619 0.2031 0.1739 0.1497 0.1479 0.1436 0.1382 0.1258 0.1626 0.1632 0.1234 0.1160 0.1294
va: 1.0467 1.0644 1.0841 1.0824 1.0926 2.0039 3.1502 3.4238 2.9509 3.6010 3.6686 3.5742 3.3915 4.0730 4.1820 4.0465 3.8911 4.0237 3.9315 3.8201 3.9080 4.1544 3.9118 3.8658 3.9160 3.9210 3.9567 1.0212 1.0024 1.0009 1.0086 1.0085 1.0282 0.9973 0.9901 0.9884 0.9924 1.0047 0.9866
dispcorr: -0.020537567 hartree
energy: -1432.020914265661
dipole: 14.68426 -12.46479 2.21947 -16.60988 15.77634 -0.83354 4.71371 -4.86551 -0.15180
magnitude: 2.37568 au
magnitude: 6.03851 debye
