program: Orca
programVersion: 4.2.1
elementType: F F F F F O N N N C C C C C C C C C C C C C C C C C C H H H H H H H H H H H H
charge: 0
multiplicity: 1
keywords: wb97x-d3
keywords: def2-TZVPP
keywords: def2/J RIJCOSX GRIDX6 NOFINALGRIDX
keywords: grid4 nofinalgrid
keywords: scfconv7
keywords: smallprint printgap noloewdin
keywords: NOSOSCF
formula: C18H12F5N3O
InChI: InChI=1/C18H12F5N3O/c1-26-8-11(16(25-26)17(22)23)18(27)24-14-5-3-2-4-10(14)9-6-12(19)15(21)13(20)7-9/h2-8,17,24H,1H3
39 atoms
F  0.332941 1.741443 -0.217517
F  0.758569 1.161312 1.840614
F  -2.631354 1.839753 -2.682688
F  -2.985325 2.167328 1.954521
F  -3.208404 3.280815 -0.484915
O  2.689352 -2.525999 0.048648
N  0.723034 -1.38661 -0.065183
N  4.573169 1.10219 -0.212746
N  3.598651 1.90736 0.183429
C  -1.57991 -2.043867 0.020208
C  -0.223735 -2.413599 0.035402
C  2.825398 -0.199558 -0.010302
C  -1.994374 -0.624025 -0.115183
C  2.531181 1.14799 0.308904
C  2.077457 -1.471525 -0.001727
C  4.167882 -0.163916 -0.333707
C  -2.562704 -3.016767 0.143577
C  0.104061 -3.765089 0.165628
C  -2.286966 0.12243 1.021565
C  -2.104297 -0.047676 -1.377523
C  -2.233753 -4.356305 0.27827
C  1.285037 1.806846 0.766125
C  -0.897074 -4.717318 0.286282
C  5.904233 1.617297 -0.448438
C  -2.513323 1.26483 -1.485817
C  -2.695918 1.431311 0.881403
C  -2.814382 2.015458 -0.365261
H  0.335816 -0.47158 -0.235676
H  4.837579 -0.950264 -0.642756
H  -3.601872 -2.712856 0.132733
H  1.131435 -4.085985 0.173414
H  -2.201068 -0.309333 2.00987
H  -1.880508 -0.614533 -2.271919
H  1.444907 2.855112 1.018672
H  -3.011057 -5.102448 0.373422
H  -0.615797 -5.757609 0.386695
H  6.614308 1.16042 0.237479
H  6.211457 1.416243 -1.472253
H  5.889985 2.690033 -0.284892
elementType: F O N C H
totalener: -1432.00724865 hartree
nucrepener: 2546.13603812 hartree
electener: -3978.14328678 hartree
oneelecener: -7028.21621564 hartree
twoeener: 3050.07292886 hartree
cpcmener: -0.02669055 hartree
kineticenergy: 1426.67635996 hartree
xcener: -128.432650691366 hartree
chargesum: 0.0000000
charge: -0.225888 -0.218559 -0.201872 -0.203001 -0.195491 -0.496798 -0.172070 0.104545 -0.296713 0.083681 0.155101 -0.128049 -0.093785 -0.015385 0.411057 -0.027514 -0.135686 -0.206285 -0.200559 -0.185493 -0.186512 0.316649 -0.149967 -0.155078 0.248436 0.247925 0.160848 0.190744 0.174622 0.139695 0.159066 0.139250 0.145290 0.130857 0.157204 0.158524 0.129554 0.128490 0.113171
qa: -0.2259 -0.2186 -0.2019 -0.2030 -0.1955 -0.4968 -0.1721 0.1045 -0.2967 0.0837 0.1551 -0.1280 -0.0938 -0.0154 0.4111 -0.0275 -0.1357 -0.2063 -0.2006 -0.1855 -0.1865 0.3166 -0.1500 -0.1551 0.2484 0.2479 0.1608 0.1907 0.1746 0.1397 0.1591 0.1393 0.1453 0.1309 0.1572 0.1585 0.1296 0.1285 0.1132
va: 1.0671 1.0592 1.0911 1.0865 1.1013 2.0114 3.2716 3.4187 2.9737 3.4290 3.8165 3.6231 3.5724 4.0558 4.1221 4.0360 3.9008 3.9481 3.8950 3.8758 3.9228 4.1441 3.9325 3.8643 3.9050 3.8863 3.9625 1.0277 1.0031 1.0057 1.0414 1.0127 1.0091 0.9921 0.9919 0.9913 0.9872 0.9880 1.0084
dispcorr: -0.020732604 hartree
energy: -1432.027981258370
dipole: 21.47584 -19.77795 1.69789 -20.66804 20.74251 0.07447 -0.98734 0.52078 -0.46655
magnitude: 1.76239 au
magnitude: 4.47965 debye
