program: Orca
programVersion: 4.2.1
elementType: F F F F F O N N N C C C C C C C C C C C C C C C C C C H H H H H H H H H H H H
charge: 0
multiplicity: 1
keywords: wb97x-d3
keywords: def2-TZVPP
keywords: def2/J RIJCOSX GRIDX6 NOFINALGRIDX
keywords: grid4 nofinalgrid
keywords: scfconv7
keywords: smallprint printgap noloewdin
keywords: NOSOSCF
formula: C18H12F5N3O
InChI: InChI=1/C18H12F5N3O/c1-26-8-11(16(25-26)17(22)23)18(27)24-14-5-3-2-4-10(14)9-6-12(19)15(21)13(20)7-9/h2-8,17,24H,1H3
39 atoms
F  0.496906 2.325031 0.535424
F  1.577611 2.101855 2.419147
F  -1.394712 1.763752 -2.661666
F  -3.621803 1.732248 1.436966
F  -2.845177 3.043603 -0.78587
O  0.542496 -0.597424 1.513982
N  0.942055 -1.847934 -0.327578
N  4.342163 0.653428 -0.540046
N  3.796106 1.72781 0.01047
C  -1.441892 -2.318939 -0.055081
C  -0.115811 -2.75927 -0.128016
C  2.386797 -0.016513 0.167572
C  -1.803432 -0.899145 -0.249439
C  2.617248 1.344504 0.453238
C  1.211313 -0.826653 0.524496
C  3.539588 -0.416458 -0.475379
C  -2.441647 -3.259637 0.183899
C  0.180067 -4.111376 -0.005004
C  -2.560908 -0.23975 0.713084
C  -1.407237 -0.2224 -1.399913
C  -2.144835 -4.607925 0.308086
C  1.737339 2.355698 1.092388
C  -0.830327 -5.037152 0.2008
C  5.695456 0.69897 -1.042947
C  -1.761768 1.098644 -1.563846
C  -2.903907 1.080356 0.519794
C  -2.509821 1.766057 -0.612985
H  1.546685 -2.001411 -1.12007
H  3.846396 -1.376761 -0.859259
H  -3.471808 -2.931297 0.245097
H  1.212531 -4.433585 -0.05728
H  -2.864922 -0.739544 1.623336
H  -0.835749 -0.714872 -2.175083
H  2.145254 3.36197 0.982244
H  -2.940593 -5.320467 0.4803
H  -0.587578 -6.087639 0.291425
H  6.407858 0.476341 -0.250099
H  5.810716 -0.028007 -1.842033
H  5.894516 1.691583 -1.435955
elementType: F O N C H
totalener: -1432.00647403 hartree
nucrepener: 2559.59649708 hartree
electener: -3991.60297111 hartree
oneelecener: -7056.86998592 hartree
twoeener: 3065.26701481 hartree
cpcmener: -0.04277255 hartree
kineticenergy: 1426.70130854 hartree
xcener: -128.434056945059 hartree
chargesum: -0.0000000
charge: -0.205961 -0.219811 -0.206352 -0.205702 -0.200097 -0.450176 -0.183353 0.094682 -0.287440 0.113297 0.101429 -0.149964 0.088628 -0.009850 0.322568 -0.021770 -0.172381 -0.195007 -0.225737 -0.207119 -0.153824 0.323222 -0.137798 -0.145471 0.224199 0.229331 0.159632 0.182788 0.176247 0.147307 0.147752 0.140844 0.136936 0.107501 0.159275 0.159434 0.127652 0.116713 0.118375
qa: -0.2060 -0.2198 -0.2064 -0.2057 -0.2001 -0.4502 -0.1834 0.0947 -0.2874 0.1133 0.1014 -0.1500 0.0886 -0.0098 0.3226 -0.0218 -0.1724 -0.1950 -0.2257 -0.2071 -0.1538 0.3232 -0.1378 -0.1455 0.2242 0.2293 0.1596 0.1828 0.1762 0.1473 0.1478 0.1408 0.1369 0.1075 0.1593 0.1594 0.1277 0.1167 0.1184
va: 1.0695 1.0482 1.0823 1.0840 1.0928 2.0755 3.1607 3.4122 2.9445 3.5363 3.6819 3.6630 3.3884 4.0320 4.2165 3.9972 3.9066 4.0270 3.9259 3.8622 3.9079 4.1768 3.9206 3.8713 3.9144 3.9309 3.9355 1.0023 0.9933 1.0028 1.0072 1.0088 1.0109 0.9930 0.9912 0.9900 0.9865 0.9941 1.0029
dispcorr: -0.020532801 hartree
energy: -1432.027006829462
dipole: 20.38257 -17.35489 3.02768 -27.00056 23.90851 -3.09205 -4.88659 2.43851 -2.44808
magnitude: 4.97199 au
magnitude: 12.63780 debye
