program: Orca
programVersion: 4.2.1
elementType: F F F F F O N N N C C C C C C C C C C C C C C C C C C H H H H H H H H H H H H
charge: 0
multiplicity: 1
keywords: wb97x-d3
keywords: def2-TZVPP
keywords: def2/J RIJCOSX GRIDX6 NOFINALGRIDX
keywords: grid4 nofinalgrid
keywords: scfconv7
keywords: smallprint printgap noloewdin
keywords: NOSOSCF
formula: C18H12F5N3O
InChI: InChI=1/C18H12F5N3O/c1-26-8-11(16(25-26)17(22)23)18(27)24-14-5-3-2-4-10(14)9-6-12(19)15(21)13(20)7-9/h2-8,17,24H,1H3
39 atoms
F  0.515577 2.364514 -0.774875
F  2.192754 3.16062 -1.929989
F  -1.389876 2.103512 2.266092
F  -3.734826 1.363483 -1.698035
F  -2.894747 3.041543 0.237037
O  0.454475 -0.825149 -1.404213
N  0.90498 -1.861478 0.556361
N  4.258924 0.728297 0.394075
N  3.704443 1.675817 -0.351966
C  -1.486655 -2.366679 0.399216
C  -0.156745 -2.788501 0.510215
C  2.319422 -0.085573 -0.181528
C  -1.85504 -0.935861 0.364429
C  2.534902 1.199524 -0.717456
C  1.149629 -0.944403 -0.40987
C  3.471496 -0.344049 0.532478
C  -2.486216 -3.336008 0.338787
C  0.142371 -4.143144 0.596048
C  -2.643689 -0.452963 -0.674949
C  -1.430726 -0.070846 1.369442
C  -2.186359 -4.686362 0.42398
C  1.591108 2.009832 -1.537805
C  -0.867442 -5.091156 0.566358
C  5.587838 0.902593 0.936737
C  -1.783441 1.259535 1.310228
C  -2.985689 0.881181 -0.70424
C  -2.559545 1.753222 0.278954
H  1.540582 -1.930544 1.335964
H  3.788499 -1.209055 1.094192
H  -3.519329 -3.022975 0.253081
H  1.177234 -4.451961 0.675171
H  -2.972481 -1.102395 -1.475709
H  -0.836216 -0.422025 2.202077
H  1.222873 1.490259 -2.420321
H  -2.982889 -5.417711 0.390051
H  -0.620794 -6.142162 0.638217
H  6.270258 0.164551 0.51975
H  5.936503 1.896454 0.675289
H  5.570592 0.804836 2.020034
elementType: F O N C H
totalener: -1432.00672336 hartree
nucrepener: 2549.02384966 hartree
electener: -3981.03057302 hartree
oneelecener: -7035.24477001 hartree
twoeener: 3054.21419699 hartree
cpcmener: -0.04110921 hartree
kineticenergy: 1426.69679222 hartree
xcener: -128.435335776470 hartree
chargesum: -0.0000000
charge: -0.206219 -0.211680 -0.206173 -0.205505 -0.199681 -0.475093 -0.173658 0.110356 -0.304837 0.105778 0.107300 -0.126406 0.081134 0.004253 0.333161 -0.015720 -0.169928 -0.196337 -0.229992 -0.197967 -0.154171 0.286064 -0.136478 -0.156760 0.222932 0.232382 0.157868 0.182485 0.175267 0.147255 0.148051 0.141405 0.138884 0.105272 0.159381 0.159474 0.127901 0.112896 0.127108
qa: -0.2062 -0.2117 -0.2062 -0.2055 -0.1997 -0.4751 -0.1737 0.1104 -0.3048 0.1058 0.1073 -0.1264 0.0811 0.0043 0.3332 -0.0157 -0.1699 -0.1963 -0.2300 -0.1980 -0.1542 0.2861 -0.1365 -0.1568 0.2229 0.2324 0.1579 0.1825 0.1753 0.1473 0.1481 0.1414 0.1389 0.1053 0.1594 0.1595 0.1279 0.1129 0.1271
va: 1.0410 1.0669 1.0817 1.0843 1.0922 2.0453 3.1732 3.3959 2.9557 3.5494 3.6721 3.5958 3.3872 3.9414 4.1921 3.9906 3.9018 4.0263 3.9195 3.8428 3.9096 4.2181 3.9226 3.8679 3.9068 3.9323 3.9384 1.0026 0.9943 1.0025 1.0070 1.0084 1.0104 0.9966 0.9911 0.9899 0.9870 1.0093 0.9878
dispcorr: -0.020488526 hartree
energy: -1432.027211889674
dipole: 18.62400 -16.05450 2.56951 -29.24377 25.48603 -3.75774 7.34412 -5.00854 2.33558
magnitude: 5.11643 au
magnitude: 13.00494 debye
