program: Orca
programVersion: 4.2.1
elementType: F F F F F O N N N C C C C C C C C C C C C C C C C C C H H H H H H H H H H H H
charge: 0
multiplicity: 1
keywords: wb97x-d3
keywords: def2-TZVPP
keywords: def2/J RIJCOSX GRIDX6 NOFINALGRIDX
keywords: grid4 nofinalgrid
keywords: scfconv7
keywords: smallprint printgap noloewdin
keywords: NOSOSCF
formula: C18H12F5N3O
InChI: InChI=1/C18H12F5N3O/c1-26-8-11(16(25-26)17(22)23)18(27)24-14-5-3-2-4-10(14)9-6-12(19)15(21)13(20)7-9/h2-8,17,24H,1H3
39 atoms
F  0.345756 1.752163 -0.200669
F  0.799424 1.230033 1.86586
F  -2.686594 1.814209 -2.689395
F  -2.992323 2.166838 1.952705
F  -3.248401 3.27083 -0.491783
O  2.688281 -2.516832 0.016682
N  0.715443 -1.376087 -0.043252
N  4.587751 1.090017 -0.210225
N  3.62345 1.907776 0.182937
C  -1.584844 -2.045206 0.021886
C  -0.227675 -2.40614 0.043745
C  2.825615 -0.193343 -0.00732
C  -2.007571 -0.628175 -0.113337
C  2.549174 1.158559 0.309228
C  2.073521 -1.470379 -0.002571
C  4.16464 -0.17467 -0.329411
C  -2.560668 -3.02606 0.132135
C  0.111028 -3.755298 0.165036
C  -2.292636 0.125984 1.01968
C  -2.136636 -0.056221 -1.375437
C  -2.222599 -4.362713 0.259244
C  1.310337 1.833877 0.765882
C  -0.883562 -4.713447 0.272225
C  5.91959 1.594995 -0.442587
C  -2.553686 1.254298 -1.490136
C  -2.711055 1.433222 0.879558
C  -2.846797 2.011334 -0.369868
H  0.32477 -0.455302 -0.162163
H  4.812121 -0.983372 -0.626351
H  -3.600658 -2.725892 0.115417
H  1.144178 -4.056598 0.17577
H  -2.190043 -0.300786 2.008065
H  -1.921624 -0.629483 -2.267397
H  1.488723 2.888708 0.981732
H  -2.99379 -5.115815 0.344887
H  -0.595971 -5.752268 0.367099
H  6.630381 1.139199 0.244636
H  6.232988 1.395991 -1.465826
H  5.904611 2.66737 -0.278321
totalener: -1431.98789003 hartree
nucrepener: 2541.59958632 hartree
electener: -3973.58747636 hartree
oneelecener: -7018.58593508 hartree
twoeener: 3044.99845872 hartree
kineticenergy: 1426.70621775 hartree
xcener: -128.433870729399 hartree
chargesum: -0.0000000
charge: -0.215563 -0.199887 -0.184759 -0.185261 -0.177040 -0.416643 -0.179905 0.090107 -0.269448 0.067779 0.131522 -0.141777 -0.103074 0.004324 0.378313 -0.028507 -0.122062 -0.161219 -0.193740 -0.186539 -0.149071 0.304698 -0.111462 -0.172304 0.241268 0.236538 0.156449 0.178589 0.162893 0.120172 0.152746 0.124314 0.128081 0.110871 0.125079 0.126971 0.120576 0.118184 0.118785
qa: -0.2156 -0.1999 -0.1848 -0.1853 -0.1770 -0.4166 -0.1799 0.0901 -0.2694 0.0678 0.1315 -0.1418 -0.1031 0.0043 0.3783 -0.0285 -0.1221 -0.1612 -0.1937 -0.1865 -0.1491 0.3047 -0.1115 -0.1723 0.2413 0.2365 0.1564 0.1786 0.1629 0.1202 0.1527 0.1243 0.1281 0.1109 0.1251 0.1270 0.1206 0.1182 0.1188
va: 1.0777 1.0824 1.1136 1.1098 1.1253 2.0870 3.2715 3.3950 2.9616 3.4652 3.9035 3.7147 3.6042 4.0173 4.1507 4.0336 3.9453 3.9897 3.9011 3.8861 3.9722 4.1622 3.9630 3.8741 3.9273 3.9098 3.9730 1.0361 1.0094 1.0111 1.0438 1.0183 1.0157 0.9946 1.0020 1.0008 0.9874 0.9886 1.0104
dispcorr: -0.020573251 hartree
energy: -1432.008463284870
dipole: 21.61686 -20.07694 1.53993 -20.76540 20.79356 0.02816 -0.99986 0.70676 -0.29311
magnitude: 1.56783 au
magnitude: 3.98510 debye
