program: Orca
programVersion: 4.2.1
elementType: F F F F F O N N N C C C C C C C C C C C C C C C C C C H H H H H H H H H H H H
charge: 0
multiplicity: 1
keywords: wb97x-d3
keywords: def2-TZVPP
keywords: def2/J RIJCOSX GRIDX6 NOFINALGRIDX
keywords: grid4 nofinalgrid
keywords: scfconv7
keywords: smallprint printgap noloewdin
keywords: NOSOSCF
formula: C18H12F5N3O
InChI: InChI=1/C18H12F5N3O/c1-26-8-11(16(25-26)17(22)23)18(27)24-14-5-3-2-4-10(14)9-6-12(19)15(21)13(20)7-9/h2-8,17,24H,1H3
39 atoms
F  2.736466 -0.721903 -2.667602
F  1.292896 0.909819 -2.628777
F  -1.789181 2.687624 -1.325727
F  -3.448387 1.410032 2.845066
F  -2.934935 3.336501 1.026252
O  0.59368 -0.78312 1.636424
N  0.710488 -1.480019 -0.51639
N  3.800664 1.65276 0.787255
N  3.779255 1.629794 -0.53603
C  -1.638471 -1.987669 -0.073105
C  -0.354068 -2.397255 -0.445296
C  2.211938 0.233442 0.288493
C  -1.96166 -0.575874 0.217096
C  2.829783 0.778206 -0.86196
C  1.105547 -0.712995 0.541385
C  2.878545 0.845311 1.3267
C  -2.645602 -2.946187 -0.004382
C  -0.116811 -3.726821 -0.772678
C  -2.558328 -0.240096 1.42711
C  -1.698367 0.417385 -0.7213
C  -2.407311 -4.271145 -0.329586
C  2.570491 0.589973 -2.311074
C  -1.138737 -4.659788 -0.728879
C  4.715258 2.533557 1.470293
C  -2.027077 1.725696 -0.436336
C  -2.882186 1.074137 1.687405
C  -2.621319 2.071316 0.764883
H  1.328495 -1.56215 -1.306388
H  2.739053 0.742101 2.390162
H  -3.642705 -2.633307 0.278891
H  0.885014 -4.033513 -1.04704
H  -2.73787 -0.992472 2.182848
H  -1.241355 0.182177 -1.671992
H  3.2519 1.193784 -2.912753
H  -3.211918 -4.992385 -0.282264
H  -0.938168 -5.689959 -0.990788
H  4.730149 2.283188 2.527507
H  5.715093 2.411646 1.061615
H  4.406383 3.571084 1.354087
totalener: -1431.98693144 hartree
nucrepener: 2539.58331045 hartree
electener: -3971.57024188 hartree
oneelecener: -7015.09577865 hartree
twoeener: 3043.52553676 hartree
kineticenergy: 1426.71878786 hartree
xcener: -128.433552142375 hartree
chargesum: 0.0000000
charge: -0.218065 -0.192098 -0.187183 -0.189332 -0.181722 -0.381611 -0.221025 0.089792 -0.263245 0.114549 0.138831 -0.158395 0.039282 0.005247 0.322266 -0.029619 -0.157270 -0.183971 -0.204848 -0.185045 -0.129737 0.318651 -0.107631 -0.146757 0.210113 0.225196 0.149782 0.174620 0.160403 0.128613 0.119449 0.120860 0.122337 0.102092 0.127207 0.126865 0.097708 0.120989 0.122703
qa: -0.2181 -0.1921 -0.1872 -0.1893 -0.1817 -0.3816 -0.2210 0.0898 -0.2632 0.1145 0.1388 -0.1584 0.0393 0.0052 0.3223 -0.0296 -0.1573 -0.1840 -0.2048 -0.1850 -0.1297 0.3187 -0.1076 -0.1468 0.2101 0.2252 0.1498 0.1746 0.1604 0.1286 0.1194 0.1209 0.1223 0.1021 0.1272 0.1269 0.0977 0.1210 0.1227
va: 1.0599 1.0909 1.1079 1.1059 1.1164 2.1301 3.1374 3.4076 2.9225 3.6561 3.7327 3.6835 3.4795 4.0249 4.2013 4.0549 3.9497 4.0815 3.9307 3.8209 3.9730 4.1753 3.9959 3.8896 3.9557 3.9455 3.9608 1.0428 1.0075 1.0065 1.0156 1.0169 1.0300 1.0006 1.0013 1.0003 0.9988 0.9978 0.9895
dispcorr: -0.020292435 hartree
energy: -1432.007223870538
dipole: 14.66537 -12.90101 1.76436 -16.21879 15.71308 -0.50571 4.33183 -4.24297 0.08886
magnitude: 1.83755 au
magnitude: 4.67069 debye
