program: Orca
programVersion: 4.2.1
elementType: F F F F F O N N N C C C C C C C C C C C C C C C C C C H H H H H H H H H H H H
charge: 0
multiplicity: 1
keywords: wb97x-d3
keywords: def2-TZVPP
keywords: def2/J RIJCOSX GRIDX6 NOFINALGRIDX
keywords: grid4 nofinalgrid
keywords: scfconv7
keywords: smallprint printgap noloewdin
keywords: NOSOSCF
formula: C18H12F5N3O
InChI: InChI=1/C18H12F5N3O/c1-26-8-11(16(25-26)17(22)23)18(27)24-14-5-3-2-4-10(14)9-6-12(19)15(21)13(20)7-9/h2-8,17,24H,1H3
39 atoms
F  0.312172 1.663607 0.719665
F  1.177143 0.717477 2.480963
F  -1.851292 2.059358 -2.695775
F  -3.775524 1.992724 1.554097
F  -3.199027 3.311633 -0.725452
O  2.624277 -2.449465 -0.45097
N  0.692826 -1.340023 0.031658
N  4.492803 1.199168 -0.22739
N  3.617095 1.873572 0.500576
C  -1.605983 -2.011997 -0.083893
C  -0.251837 -2.371072 0.014592
C  2.794291 -0.163622 -0.00996
C  -2.018525 -0.598408 -0.25077
C  2.581329 1.074182 0.642699
C  2.038902 -1.428666 -0.155814
C  4.053869 -0.02435 -0.549385
C  -2.582759 -2.997775 -0.020546
C  0.087097 -3.71828 0.142334
C  -2.716626 0.049229 0.763083
C  -1.722536 0.084935 -1.428256
C  -2.244947 -4.333401 0.112488
C  1.45347 1.573188 1.469311
C  -0.906471 -4.681883 0.186851
C  5.751036 1.809646 -0.576832
C  -2.122309 1.396553 -1.57498
C  -3.109623 1.361074 0.591666
C  -2.81842 2.049399 -0.572333
H  0.308375 -0.414933 0.135812
H  4.636018 -0.722143 -1.128322
H  -3.622034 -2.704057 -0.097464
H  1.120154 -4.015148 0.210862
H  -2.942929 -0.459375 1.690526
H  -1.19298 -0.404752 -2.234905
H  1.670345 2.561873 1.877444
H  -3.01639 -5.090073 0.150909
H  -0.621455 -5.72081 0.287483
H  6.286557 2.102781 0.323338
H  6.351725 1.093244 -1.130049
H  5.586108 2.6892 -1.195661
totalener: -1431.98927097 hartree
nucrepener: 2528.33515691 hartree
electener: -3960.32442788 hartree
oneelecener: -6991.96434598 hartree
twoeener: 3031.63991810 hartree
kineticenergy: 1426.70491775 hartree
xcener: -128.433804501492 hartree
chargesum: -0.0000000
charge: -0.208884 -0.194132 -0.184368 -0.183923 -0.176449 -0.410294 -0.184498 0.089420 -0.263637 0.105154 0.115104 -0.152598 -0.064406 0.000082 0.365715 -0.032906 -0.141673 -0.152191 -0.213251 -0.216305 -0.144603 0.314369 -0.113795 -0.144786 0.248942 0.239237 0.148704 0.176078 0.159237 0.121677 0.141752 0.128984 0.132240 0.104197 0.125337 0.127084 0.122147 0.095519 0.121719
qa: -0.2089 -0.1941 -0.1844 -0.1839 -0.1764 -0.4103 -0.1845 0.0894 -0.2636 0.1052 0.1151 -0.1526 -0.0644 0.0001 0.3657 -0.0329 -0.1417 -0.1522 -0.2133 -0.2163 -0.1446 0.3144 -0.1138 -0.1448 0.2489 0.2392 0.1487 0.1761 0.1592 0.1217 0.1418 0.1290 0.1322 0.1042 0.1253 0.1271 0.1221 0.0955 0.1217
va: 1.0808 1.0887 1.1137 1.1135 1.1253 2.0944 3.2541 3.4114 2.9245 3.4791 3.8763 3.7037 3.5747 4.0183 4.1743 4.0474 3.9465 4.0177 3.9327 3.8677 3.9709 4.1744 3.9823 3.8917 3.9221 3.9303 3.9714 1.0446 1.0073 1.0100 1.0384 1.0159 1.0138 0.9978 1.0019 1.0004 0.9943 0.9996 0.9921
dispcorr: -0.019934681 hartree
energy: -1432.009205650545
dipole: 20.53976 -19.12033 1.41944 -19.51949 19.64364 0.12415 -2.38071 2.10903 -0.27168
magnitude: 1.45052 au
magnitude: 3.68694 debye
