program: Orca
programVersion: 4.2.1
elementType: F F F F F O N N N C C C C C C C C C C C C C C C C C C H H H H H H H H H H H H
charge: 0
multiplicity: 1
keywords: wb97x-d3
keywords: def2-TZVPP
keywords: def2/J RIJCOSX GRIDX6 NOFINALGRIDX
keywords: grid4 nofinalgrid
keywords: scfconv7
keywords: smallprint printgap noloewdin
keywords: NOSOSCF
formula: C18H12F5N3O
InChI: InChI=1/C18H12F5N3O/c1-26-8-11(16(25-26)17(22)23)18(27)24-14-5-3-2-4-10(14)9-6-12(19)15(21)13(20)7-9/h2-8,17,24H,1H3
39 atoms
F  3.695672 -1.764049 -1.488279
F  2.56887 -0.500029 -2.855521
F  -2.163713 2.877781 -1.194544
F  -3.482668 1.363717 3.020341
F  -3.163583 3.384737 1.261159
O  0.492488 -0.628886 1.49079
N  0.541655 -1.234366 -0.68982
N  3.514874 2.018749 0.536636
N  4.010317 1.42028 -0.534458
C  -1.773402 -1.837253 -0.17111
C  -0.497585 -2.184215 -0.623615
C  2.147807 0.353197 0.158357
C  -2.122613 -0.452975 0.208331
C  3.200684 0.412406 -0.783766
C  0.999337 -0.548888 0.393845
C  2.408184 1.416069 0.992738
C  -2.747704 -2.829975 -0.110356
C  -0.232331 -3.485214 -1.032751
C  -2.643594 -0.191064 1.470339
C  -1.960618 0.588824 -0.699103
C  -2.482695 -4.126145 -0.519956
C  3.560467 -0.483198 -1.910469
C  -1.222358 -4.452171 -0.99544
C  4.14436 3.211055 1.047095
C  -2.310597 1.871653 -0.33337
C  -2.990835 1.098124 1.811811
C  -2.828593 2.144123 0.920306
H  1.021689 -1.141611 -1.568697
H  1.86972 1.758042 1.861212
H  -3.739409 -2.567196 0.235689
H  0.767431 -3.737352 -1.363764
H  -2.742785 -0.981231 2.20177
H  -1.573807 0.410044 -1.692791
H  4.4838 -0.160559 -2.394398
H  -3.261734 -4.875239 -0.477004
H  -1.003096 -5.460255 -1.320551
H  3.944928 4.060944 0.396657
H  3.754955 3.423377 2.038781
H  5.218084 3.056889 1.112341
totalener: -1431.98644342 hartree
nucrepener: 2509.29744130 hartree
electener: -3941.28388472 hartree
oneelecener: -6954.25996308 hartree
twoeener: 3012.97607836 hartree
kineticenergy: 1426.72371777 hartree
xcener: -128.433886073129 hartree
chargesum: -0.0000000
charge: -0.195372 -0.216915 -0.189386 -0.188050 -0.181297 -0.383144 -0.227789 0.085499 -0.261141 0.129612 0.132231 -0.136237 0.039790 0.000742 0.317653 -0.034637 -0.153282 -0.194202 -0.204858 -0.214562 -0.127457 0.313866 -0.100539 -0.147784 0.222616 0.228778 0.139989 0.186408 0.160866 0.128372 0.128194 0.121582 0.117790 0.104518 0.127352 0.129123 0.121105 0.099147 0.121421
qa: -0.1954 -0.2169 -0.1894 -0.1881 -0.1813 -0.3831 -0.2278 0.0855 -0.2611 0.1296 0.1322 -0.1362 0.0398 0.0007 0.3177 -0.0346 -0.1533 -0.1942 -0.2049 -0.2146 -0.1275 0.3139 -0.1005 -0.1478 0.2226 0.2288 0.1400 0.1864 0.1609 0.1284 0.1282 0.1216 0.1178 0.1045 0.1274 0.1291 0.1211 0.0991 0.1214
va: 1.0870 1.0623 1.1041 1.1074 1.1165 2.1346 3.1413 3.4117 2.9262 3.5911 3.7349 3.7104 3.4792 4.0105 4.1967 4.0530 3.9409 4.0819 3.9292 3.8650 3.9718 4.1811 3.9764 3.8899 3.9345 3.9363 3.9637 1.0353 1.0059 1.0072 1.0184 1.0174 1.0198 0.9995 1.0012 1.0002 0.9887 0.9988 0.9985
dispcorr: -0.019821568 hartree
energy: -1432.006264987661
dipole: 10.73148 -9.59185 1.13963 -10.83678 10.92831 0.09153 0.49486 -0.79828 -0.30342
magnitude: 1.18288 au
magnitude: 3.00663 debye
