program: Orca
programVersion: 4.2.1
elementType: F F F F F O N N N C C C C C C C C C C C C C C C C C C H H H H H H H H H H H H
charge: 0
multiplicity: 1
keywords: wb97x-d3
keywords: def2-TZVPP
keywords: def2/J RIJCOSX GRIDX6 NOFINALGRIDX
keywords: grid4 nofinalgrid
keywords: scfconv7
keywords: smallprint printgap noloewdin
keywords: NOSOSCF
formula: C18H12F5N3O
InChI: InChI=1/C18H12F5N3O/c1-26-8-11(16(25-26)17(22)23)18(27)24-14-5-3-2-4-10(14)9-6-12(19)15(21)13(20)7-9/h2-8,17,24H,1H3
39 atoms
F  1.204424 0.610032 -2.526612
F  0.305665 1.618199 -0.81787
F  -1.835697 2.198836 2.565173
F  -3.761677 1.909331 -1.674775
F  -3.175847 3.348943 0.528611
O  2.612941 -2.417581 0.591264
N  0.688106 -1.342344 0.016007
N  4.48269 1.214188 0.197874
N  3.611004 1.85381 -0.566454
C  -1.609417 -2.009748 0.180413
C  -0.255384 -2.372058 0.09377
C  2.787003 -0.158935 0.028773
C  -2.020381 -0.588718 0.270863
C  2.577529 1.047394 -0.682262
C  2.030574 -1.416106 0.231496
C  4.04129 0.0062 0.571822
C  -2.584946 -2.998733 0.17895
C  0.085376 -3.72354 0.038321
C  -2.715564 0.005729 -0.77694
C  -1.720403 0.156553 1.409032
C  -2.245209 -4.339234 0.119208
C  1.460012 1.506169 -1.54453
C  -0.90666 -4.689604 0.054808
C  5.735863 1.837943 0.54864
C  -2.112358 1.47653 1.483144
C  -3.100463 1.327542 -0.678283
C  -2.80447 2.077344 0.445766
H  0.302844 -0.426346 -0.147878
H  4.618307 -0.663931 1.187793
H  -3.624278 -2.702828 0.245881
H  1.118569 -4.022169 -0.020896
H  -2.944594 -0.5520 -1.675014
H  -1.191848 -0.290721 2.240558
H  1.677363 2.479606 -1.98758
H  -3.015372 -5.098158 0.129202
H  -0.620572 -5.732164 0.01096
H  5.772821 2.064004 1.613214
H  6.570154 1.188235 0.291271
H  5.818865 2.762382 -0.013367
totalener: -1431.98875428 hartree
nucrepener: 2529.21463827 hartree
electener: -3961.20339255 hartree
oneelecener: -6993.73822926 hartree
twoeener: 3032.53483671 hartree
kineticenergy: 1426.70462820 hartree
xcener: -128.433531880128 hartree
chargesum: 0.0000000
charge: -0.194041 -0.209160 -0.184446 -0.183900 -0.176488 -0.409802 -0.185383 0.091715 -0.269674 0.104411 0.112694 -0.145732 -0.064141 -0.003738 0.364719 -0.028063 -0.141273 -0.149297 -0.210841 -0.216695 -0.144192 0.316278 -0.114033 -0.170507 0.248943 0.238872 0.149872 0.176243 0.162498 0.121449 0.141335 0.128519 0.131831 0.103229 0.125240 0.126904 0.119747 0.117739 0.119169
qa: -0.1940 -0.2092 -0.1844 -0.1839 -0.1765 -0.4098 -0.1854 0.0917 -0.2697 0.1044 0.1127 -0.1457 -0.0641 -0.0037 0.3647 -0.0281 -0.1413 -0.1493 -0.2108 -0.2167 -0.1442 0.3163 -0.1140 -0.1705 0.2489 0.2389 0.1499 0.1762 0.1625 0.1214 0.1413 0.1285 0.1318 0.1032 0.1252 0.1269 0.1197 0.1177 0.1192
va: 1.0884 1.0807 1.1137 1.1135 1.1253 2.0946 3.2543 3.3919 2.9501 3.4804 3.8770 3.7070 3.5752 4.0149 4.1759 4.0340 3.9461 4.0200 3.9314 3.8702 3.9705 4.1744 3.9836 3.8745 3.9208 3.9303 3.9703 1.0449 1.0082 1.0101 1.0379 1.0160 1.0139 0.9980 1.0019 1.0005 0.9869 0.9896 1.0100
dispcorr: -0.019980969 hartree
energy: -1432.008735248065
dipole: 20.38432 -18.98610 1.39822 -19.38441 19.52665 0.14225 3.66209 -3.38549 0.27660
magnitude: 1.43240 au
magnitude: 3.64086 debye
