program: Orca
programVersion: 4.2.1
elementType: F F F O O N C C C C C C C C C C C C C C C C C H H H H H H H H H H H H H H H H
charge: 0
multiplicity: 1
keywords: wb97x-d3
keywords: def2-TZVPP
keywords: def2/J RIJCOSX GRIDX6 NOFINALGRIDX
keywords: grid4 nofinalgrid
keywords: scfconv7
keywords: smallprint printgap noloewdin
keywords: NOSOSCF
formula: C17H16F3NO2
InChI: InChI=1/C17H16F3NO2/c1-11(2)23-13-7-5-6-12(10-13)21-16(22)14-8-3-4-9-15(14)17(18,19)20/h3-11,21H,1-2H3
39 atoms
F  -3.279992 2.904605 -0.19669
F  -1.353661 2.074787 0.255318
F  -2.126385 1.98619 -1.753176
O  4.499731 -0.542498 -0.323473
O  -0.3388 -0.319826 -1.177165
N  -0.171297 -0.917488 1.020307
C  4.206023 -0.096178 -1.653653
C  -2.335577 -0.585898 0.069058
C  1.21024 -0.994581 1.238902
C  3.511741 -0.789019 0.561568
C  -3.108656 0.55791 -0.151265
C  2.155498 -0.715122 0.251879
C  -0.845245 -0.582648 -0.100412
C  3.825774 1.373854 -1.665297
C  5.453933 -0.358886 -2.470733
C  1.61796 -1.352865 2.521594
C  3.923069 -1.146953 1.845516
C  -2.964459 -1.785024 0.377835
C  -4.491669 0.481686 -0.066854
C  2.971104 -1.426772 2.808713
C  -2.466687 1.878247 -0.463348
C  -4.348028 -1.857817 0.451512
C  -5.110473 -0.724856 0.226798
H  3.390041 -0.697965 -2.067156
H  1.826624 -0.443092 -0.735735
H  -0.736513 -1.090404 1.839423
H  4.64427 1.989495 -1.289148
H  3.61055 1.68876 -2.68647
H  2.940118 1.587413 -1.066889
H  6.303146 0.215413 -2.097317
H  5.282816 -0.066796 -3.506343
H  5.719692 -1.416023 -2.46431
H  0.884558 -1.567455 3.288786
H  4.97843 -1.204406 2.077413
H  -2.372999 -2.675505 0.54587
H  -5.104453 1.358086 -0.223305
H  3.28745 -1.70553 3.804916
H  -4.824025 -2.800244 0.684481
H  -6.188915 -0.770084 0.2853
elementType: F O N C H
totalener: -1162.34450757 hartree
nucrepener: 1936.32204094 hartree
electener: -3098.66654851 hartree
oneelecener: -5439.58862617 hartree
twoeener: 2340.92207766 hartree
cpcmener: -0.03393190 hartree
kineticenergy: 1157.74256702 hartree
xcener: -106.862509529747 hartree
chargesum: 0.0000000
charge: -0.178950 -0.180892 -0.176191 -0.343957 -0.495717 -0.107121 0.160245 0.034482 0.101490 0.313273 -0.186866 -0.226122 0.438826 -0.265271 -0.261947 -0.257278 -0.294842 -0.198070 -0.054817 -0.095446 0.531183 -0.130748 -0.165574 0.071058 0.141008 0.180627 0.091423 0.098459 0.094584 0.090775 0.091183 0.097938 0.139586 0.142115 0.156194 0.150328 0.160626 0.167250 0.167156
qa: -0.1790 -0.1809 -0.1762 -0.3440 -0.4957 -0.1071 0.1602 0.0345 0.1015 0.3133 -0.1869 -0.2261 0.4388 -0.2653 -0.2619 -0.2573 -0.2948 -0.1981 -0.0548 -0.0954 0.5312 -0.1307 -0.1656 0.0711 0.1410 0.1806 0.0914 0.0985 0.0946 0.0908 0.0912 0.0979 0.1396 0.1421 0.1562 0.1503 0.1606 0.1672 0.1672
va: 1.1222 1.1158 1.1166 2.0792 2.0082 3.2767 3.8097 3.6833 3.9442 3.8161 3.8313 3.8309 3.9442 3.8964 3.9236 3.9425 4.0068 3.9857 3.8536 3.9057 4.4654 3.9157 3.9266 0.9995 1.0503 0.9997 1.0081 1.0070 1.0072 1.0067 1.0052 1.0081 1.0078 1.0118 1.0057 1.0065 0.9870 0.9873 0.9879
dispcorr: -0.017047056 hartree
energy: -1162.361554622633
dipole: 28.57668 -30.28155 -1.70487 -13.61681 12.23085 -1.38596 -1.82900 3.31066 1.48167
magnitude: 2.65006 au
magnitude: 6.73591 debye
