program: Orca
programVersion: 4.2.1
elementType: F F F O O N C C C C C C C C C C C C C C C C C H H H H H H H H H H H H H H H H
charge: 0
multiplicity: 1
keywords: wb97x-d3
keywords: def2-TZVPP
keywords: def2/J RIJCOSX GRIDX6 NOFINALGRIDX
keywords: grid4 nofinalgrid
keywords: scfconv7
keywords: smallprint printgap noloewdin
keywords: NOSOSCF
formula: C17H16F3NO2
InChI: InChI=1/C17H16F3NO2/c1-11(2)23-13-7-5-6-12(10-13)21-16(22)14-8-3-4-9-15(14)17(18,19)20/h3-11,21H,1-2H3
39 atoms
F  -2.150399 -1.70505 1.220159
F  -4.182564 -1.391671 1.832002
F  -3.767484 -2.114639 -0.143266
O  4.888712 0.304256 0.3332
O  -1.263673 -1.256279 -1.546304
N  0.158689 0.102848 -0.387195
C  4.801013 1.557439 1.022432
C  -2.17122 0.615748 -0.412427
C  1.418293 -0.463714 -0.622622
C  3.79142 -0.266988 -0.203173
C  -3.277602 0.149384 0.303014
C  2.497615 0.211483 -0.043737
C  -1.052621 -0.289791 -0.835153
C  6.056129 1.667829 1.861782
C  4.672689 2.705376 0.037469
C  1.630921 -1.619381 -1.367423
C  4.010725 -1.426496 -0.950714
C  -2.136727 1.941287 -0.827185
C  -4.332767 1.008718 0.578398
C  2.934443 -2.080086 -1.515938
C  -3.3429 -1.265536 0.798593
C  -3.197756 2.79333 -0.557114
C  -4.297087 2.325121 0.141561
H  3.938459 1.543572 1.69628
H  2.29673 1.10812 0.528561
H  0.163257 0.910501 0.219165
H  6.034994 2.595884 2.432282
H  6.134811 0.844406 2.572201
H  6.95331 1.678202 1.240502
H  3.775927 2.634324 -0.578967
H  5.538509 2.744533 -0.625885
H  4.620472 3.651233 0.577002
H  0.818774 -2.158931 -1.823152
H  5.017756 -1.802815 -1.077265
H  -1.2851 2.310378 -1.383976
H  -5.191258 0.666233 1.139228
H  3.106966 -2.979276 -2.092711
H  -3.161634 3.819826 -0.895509
H  -5.128135 2.982179 0.35754
elementType: F O N C H
totalener: -1162.34464084 hartree
nucrepener: 1906.38171801 hartree
electener: -3068.72635886 hartree
oneelecener: -5379.12589942 hartree
twoeener: 2310.39954056 hartree
cpcmener: -0.03835106 hartree
kineticenergy: 1157.73767603 hartree
xcener: -106.861098081344 hartree
chargesum: -0.0000000
charge: -0.180842 -0.179751 -0.174735 -0.345749 -0.490845 -0.112160 0.161386 0.025838 0.121394 0.321391 -0.176918 -0.201722 0.434966 -0.260266 -0.263337 -0.277173 -0.291144 -0.203443 -0.055193 -0.120221 0.528519 -0.125202 -0.168697 0.069327 0.122875 0.179530 0.090859 0.097697 0.090240 0.096351 0.090580 0.098057 0.156476 0.141820 0.156627 0.149463 0.159358 0.167187 0.167456
qa: -0.1808 -0.1798 -0.1747 -0.3457 -0.4908 -0.1122 0.1614 0.0258 0.1214 0.3214 -0.1769 -0.2017 0.4350 -0.2603 -0.2633 -0.2772 -0.2911 -0.2034 -0.0552 -0.1202 0.5285 -0.1252 -0.1687 0.0693 0.1229 0.1795 0.0909 0.0977 0.0902 0.0964 0.0906 0.0981 0.1565 0.1418 0.1566 0.1495 0.1594 0.1672 0.1675
va: 1.1165 1.1207 1.1176 2.0757 2.0106 3.2785 3.8153 3.6861 3.8990 3.7961 3.8238 3.8428 3.9580 3.9236 3.9010 3.9595 4.0094 3.9889 3.8556 3.9376 4.4694 3.9126 3.9296 0.9997 1.0212 1.0027 1.0054 1.0079 1.0069 1.0043 1.0081 1.0070 1.0371 1.0116 1.0064 1.0067 0.9895 0.9873 0.9878
dispcorr: -0.016708178 hartree
energy: -1162.361349022327
dipole: 41.02893 -40.66333 0.36561 24.13986 -20.37712 3.76274 -0.63194 1.82349 1.19155
magnitude: 3.96380 au
magnitude: 10.07517 debye
