program: Orca
programVersion: 4.2.1
elementType: F F F O O N C C C C C C C C C C C C C C C C C H H H H H H H H H H H H H H H H
charge: 0
multiplicity: 1
keywords: wb97x-d3
keywords: def2-TZVPP
keywords: def2/J RIJCOSX GRIDX6 NOFINALGRIDX
keywords: grid4 nofinalgrid
keywords: scfconv7
keywords: smallprint printgap noloewdin
keywords: NOSOSCF
formula: C17H16F3NO2
InChI: InChI=1/C17H16F3NO2/c1-11(2)23-13-7-5-6-12(10-13)21-16(22)14-8-3-4-9-15(14)17(18,19)20/h3-11,21H,1-2H3
39 atoms
F  -2.029143 -1.493612 -1.361123
F  -3.699717 -2.102913 -0.146068
F  -4.036215 -1.150481 -2.037831
O  4.832228 0.233568 -0.407295
O  -1.29309 -1.369124 1.512534
N  0.137122 0.116093 0.531615
C  4.742777 1.5033 -1.066735
C  -2.20021 0.596763 0.549962
C  1.39238 -0.486079 0.688959
C  3.748002 -0.328941 0.163043
C  -3.252368 0.207961 -0.283785
C  2.460207 0.184746 0.084275
C  -1.078696 -0.333824 0.907089
C  4.691633 2.634214 -0.055908
C  5.958722 1.59978 -1.963966
C  1.611144 -1.670469 1.384441
C  3.972037 -1.52127 0.85585
C  -2.227056 1.8533 1.141253
C  -4.314005 1.074464 -0.503783
C  2.907895 -2.167773 1.451036
C  -3.253756 -1.134228 -0.954436
C  -3.297526 2.710141 0.929321
C  -4.341379 2.318849 0.108859
H  3.847714 1.523619 -1.69742
H  2.254944 1.104614 -0.447889
H  0.141924 0.977016 0.003551
H  5.594909 2.647825 0.556094
H  4.624602 3.589863 -0.57621
H  3.831257 2.566687 0.610325
H  5.934633 2.539856 -2.514582
H  5.981557 0.789367 -2.69275
H  6.883941 1.573953 -1.386007
H  0.810305 -2.205556 1.864608
H  4.972892 -1.927938 0.917846
H  -1.4182 2.159894 1.791691
H  -5.131108 0.794071 -1.153508
H  3.084792 -3.090512 1.987657
H  -3.31124 3.680381 1.406287
H  -5.178302 2.980461 -0.065274
elementType: F O N C H
totalener: -1162.34451399 hartree
nucrepener: 1908.72918602 hartree
electener: -3071.07370002 hartree
oneelecener: -5383.83154049 hartree
twoeener: 2312.75784048 hartree
cpcmener: -0.03820959 hartree
kineticenergy: 1157.74011660 hartree
xcener: -106.861212437906 hartree
chargesum: 0.0000000
charge: -0.180913 -0.175263 -0.178833 -0.345067 -0.489971 -0.113131 0.161182 0.026062 0.117685 0.325485 -0.171974 -0.199902 0.430328 -0.263098 -0.260481 -0.277162 -0.292794 -0.204551 -0.055696 -0.119100 0.528278 -0.123858 -0.170334 0.069944 0.121306 0.179656 0.089983 0.098137 0.096298 0.090897 0.097827 0.090777 0.157001 0.141082 0.155689 0.149839 0.159412 0.167983 0.167275
qa: -0.1809 -0.1753 -0.1788 -0.3451 -0.4900 -0.1131 0.1612 0.0261 0.1177 0.3255 -0.1720 -0.1999 0.4303 -0.2631 -0.2605 -0.2772 -0.2928 -0.2046 -0.0557 -0.1191 0.5283 -0.1239 -0.1703 0.0699 0.1213 0.1797 0.0900 0.0981 0.0963 0.0909 0.0978 0.0908 0.1570 0.1411 0.1557 0.1498 0.1594 0.1680 0.1673
va: 1.1159 1.1172 1.1224 2.0770 2.0105 3.2766 3.8123 3.6979 3.9034 3.7939 3.8239 3.8391 3.9521 3.9010 3.9230 3.9590 4.0109 3.9909 3.8561 3.9352 4.4712 3.9092 3.9296 0.9998 1.0220 1.0019 1.0080 1.0069 1.0045 1.0055 1.0079 1.0069 1.0360 1.0120 1.0061 1.0066 0.9893 0.9868 0.9880
dispcorr: -0.016740988 hartree
energy: -1162.361254979900
dipole: 40.12134 -39.80304 0.31829 22.95465 -19.14303 3.81161 2.08419 -2.92924 -0.84506
magnitude: 3.91712 au
magnitude: 9.95653 debye
