program: Orca
programVersion: 4.2.1
elementType: F F F O O N C C C C C C C C C C C C C C C C C H H H H H H H H H H H H H H H H
charge: 0
multiplicity: 1
keywords: wb97x-d3
keywords: def2-TZVPP
keywords: def2/J RIJCOSX GRIDX6 NOFINALGRIDX
keywords: grid4 nofinalgrid
keywords: scfconv7
keywords: smallprint printgap noloewdin
keywords: NOSOSCF
formula: C17H16F3NO2
InChI: InChI=1/C17H16F3NO2/c1-11(2)23-13-7-5-6-12(10-13)21-16(22)14-8-3-4-9-15(14)17(18,19)20/h3-11,21H,1-2H3
39 atoms
F  -3.628071 -2.135178 0.232161
F  -1.903756 -1.486672 1.348386
F  -3.874611 -1.191091 2.14196
O  4.842921 0.392911 0.094992
O  -1.319775 -1.337415 -1.536602
N  0.117578 0.204981 -0.661006
C  4.724634 1.497795 1.001172
C  -2.230018 0.608342 -0.535419
C  1.378628 -0.358607 -0.896306
C  3.747798 -0.179712 -0.444049
C  -3.227265 0.186826 0.34849
C  2.452419 0.294082 -0.283307
C  -1.103747 -0.288214 -0.956381
C  4.276581 1.026917 2.372912
C  6.088371 2.154142 1.04688
C  1.597546 -1.486981 -1.679273
C  3.9722 -1.318064 -1.222051
C  -2.317457 1.869578 -1.110524
C  -4.296765 1.025065 0.631446
C  2.901703 -1.946517 -1.825743
C  -3.158089 -1.156403 1.014066
C  -3.394301 2.69904 -0.833018
C  -4.385345 2.274326 0.034756
H  4.006997 2.222037 0.601339
H  2.246458 1.169291 0.318762
H  0.127367 1.062339 -0.126912
H  4.196076 1.880755 3.045842
H  3.303365 0.535916 2.354303
H  5.000198 0.33029 2.799267
H  6.399878 2.496132 0.059718
H  6.846768 1.471303 1.433413
H  6.05554 3.023458 1.703172
H  0.791679 -2.006518 -2.168291
H  4.979153 -1.693522 -1.349197
H  -1.549856 2.202788 -1.796699
H  -5.071721 0.71963 1.320134
H  3.079407 -2.82493 -2.43196
H  -3.454822 3.673705 -1.296942
H  -5.227217 2.914145 0.259322
elementType: F O N C H
totalener: -1162.34466472 hartree
nucrepener: 1911.09615461 hartree
electener: -3073.44081933 hartree
oneelecener: -5388.59285704 hartree
twoeener: 2315.15203771 hartree
cpcmener: -0.03829495 hartree
kineticenergy: 1157.74133694 hartree
xcener: -106.861665347808 hartree
chargesum: 0.0000000
charge: -0.175258 -0.181068 -0.178979 -0.345715 -0.490170 -0.117028 0.161247 0.026988 0.111664 0.318190 -0.169248 -0.192665 0.430779 -0.264758 -0.260552 -0.272418 -0.288844 -0.211644 -0.051396 -0.120475 0.527386 -0.119732 -0.172552 0.069790 0.122824 0.180258 0.099110 0.097248 0.090400 0.097126 0.090162 0.091883 0.155930 0.142408 0.155223 0.149953 0.158997 0.167641 0.167294
qa: -0.1753 -0.1811 -0.1790 -0.3457 -0.4902 -0.1170 0.1612 0.0270 0.1117 0.3182 -0.1692 -0.1927 0.4308 -0.2648 -0.2606 -0.2724 -0.2888 -0.2116 -0.0514 -0.1205 0.5274 -0.1197 -0.1726 0.0698 0.1228 0.1803 0.0991 0.0972 0.0904 0.0971 0.0902 0.0919 0.1559 0.1424 0.1552 0.1500 0.1590 0.1676 0.1673
va: 1.1173 1.1156 1.1221 2.0763 2.0102 3.2768 3.8140 3.6943 3.9049 3.8033 3.8224 3.8383 3.9529 3.8998 3.9247 3.9609 4.0093 3.9907 3.8536 3.9356 4.4723 3.9051 3.9316 0.9998 1.0208 1.0017 1.0064 1.0036 1.0082 1.0083 1.0072 1.0048 1.0345 1.0113 1.0068 1.0064 0.9895 0.9869 0.9880
dispcorr: -0.016732013 hartree
energy: -1162.361396729445
dipole: 38.69918 -38.46246 0.23672 20.69292 -16.97327 3.71965 0.84202 0.15193 0.99395
magnitude: 3.85743 au
magnitude: 9.80481 debye
