program: Orca
programVersion: 4.2.1
elementType: F F F O O N C C C C C C C C C C C C C C C C C H H H H H H H H H H H H H H H H
charge: 0
multiplicity: 1
keywords: wb97x-d3
keywords: def2-TZVPP
keywords: def2/J RIJCOSX GRIDX6 NOFINALGRIDX
keywords: grid4 nofinalgrid
keywords: scfconv7
keywords: smallprint printgap noloewdin
keywords: NOSOSCF
formula: C17H16F3NO2
InChI: InChI=1/C17H16F3NO2/c1-11(2)23-13-7-5-6-12(10-13)21-16(22)14-8-3-4-9-15(14)17(18,19)20/h3-11,21H,1-2H3
39 atoms
F  -3.683386 -1.652953 -1.599678
F  -2.098198 -2.00904 -0.185394
F  -4.134776 -2.410603 0.35478
O  4.313961 -0.101419 1.228231
O  -1.334454 0.204672 -1.972608
N  -0.109715 0.654656 -0.099786
C  5.722698 -0.290772 1.043057
C  -2.485354 0.796619 0.016517
C  1.207169 0.435295 -0.526452
C  3.496629 0.059043 0.168132
C  -3.493478 -0.151905 0.210285
C  2.156974 0.279461 0.476819
C  -1.257814 0.508008 -0.795581
C  6.410378 1.028207 0.741136
C  6.235046 -0.914761 2.324172
C  1.59546 0.384902 -1.865793
C  3.891968 -0.001309 -1.166889
C  -2.645023 2.076416 0.532549
C  -4.642859 0.196802 0.906104
C  2.932322 0.165461 -2.155118
C  -3.351787 -1.55328 -0.307325
C  -3.799927 2.422392 1.218841
C  -4.799089 1.482627 1.403103
H  5.889807 -0.995567 0.222014
H  1.857741 0.317961 1.518212
H  -0.213747 0.825389 0.890174
H  6.029563 1.503883 -0.162891
H  6.289533 1.728045 1.5697
H  7.477942 0.862426 0.595068
H  5.745472 -1.867176 2.528882
H  6.079661 -0.253744 3.178561
H  7.304774 -1.104077 2.2395
H  0.891172 0.521216 -2.668889
H  4.919314 -0.170273 -1.455484
H  -1.870248 2.817082 0.383563
H  -5.42733 -0.527126 1.076374
H  3.241398 0.127062 -3.191346
H  -3.913986 3.425282 1.606587
H  -5.701031 1.740967 1.940203
elementType: F O N C H
totalener: -1162.34464745 hartree
nucrepener: 1891.92975743 hartree
electener: -3054.27440489 hartree
oneelecener: -5350.70924044 hartree
twoeener: 2296.43483556 hartree
cpcmener: -0.03647480 hartree
kineticenergy: 1157.74154138 hartree
xcener: -106.861089985447 hartree
chargesum: -0.0000000
charge: -0.175494 -0.181150 -0.179096 -0.345314 -0.489105 -0.123024 0.160885 0.038222 0.173021 0.328254 -0.158848 -0.271844 0.410823 -0.261874 -0.258896 -0.256078 -0.239360 -0.212132 -0.053910 -0.176411 0.528086 -0.117518 -0.173243 0.069068 0.122719 0.181143 0.094621 0.089829 0.098207 0.097567 0.090137 0.090929 0.153884 0.143564 0.154788 0.149838 0.161628 0.167806 0.168278
qa: -0.1755 -0.1812 -0.1791 -0.3453 -0.4891 -0.1230 0.1609 0.0382 0.1730 0.3283 -0.1588 -0.2718 0.4108 -0.2619 -0.2589 -0.2561 -0.2394 -0.2121 -0.0539 -0.1764 0.5281 -0.1175 -0.1732 0.0691 0.1227 0.1811 0.0946 0.0898 0.0982 0.0976 0.0901 0.0909 0.1539 0.1436 0.1548 0.1498 0.1616 0.1678 0.1683
va: 1.1170 1.1154 1.1219 2.0680 2.0085 3.2690 3.8141 3.6951 3.8503 3.8414 3.8152 4.0647 3.9753 3.8991 3.9262 3.9605 3.8584 3.9850 3.8513 3.9699 4.4715 3.9019 3.9315 0.9999 1.0285 1.0011 1.0055 1.0080 1.0066 1.0080 1.0074 1.0052 1.0303 1.0067 1.0072 1.0066 0.9916 0.9867 0.9876
dispcorr: -0.016547673 hartree
energy: -1162.361195125272
dipole: 46.09717 -45.08845 1.00872 14.49877 -12.84008 1.65869 11.07870 -8.77781 2.30089
magnitude: 3.01046 au
magnitude: 7.65198 debye
