program: Gaussian 09
title: 000069408
version: EM64L-G09RevD.01
frameworkgroup: C1[X(C5H9ClO3)]
method: RPBEPBE
basis: SDD
operation: Freq
keyword: #p
keyword: freq=noraman
keyword: PBEPBE/SDD
title: #p freq=noraman PBEPBE/SDD
converged: NO YES NO NO
title: Mulliken charges:
elementType: Cl O O O C C C C C H H H H H H H H H
charge: -0.031151 -0.281743 -0.200886 -0.149068 -0.256075 -0.288939 -0.206594 -0.673185 0.104774 0.208625 0.208297 0.255303 0.255218 0.193719 0.193727 0.206782 0.230598 0.230598
chargesum: 0.00000
title: Mulliken charges with hydrogens summed into heavy atoms:
elementType: Cl O O O C C C C C
charge: -0.031151 -0.281743 -0.200886 -0.149068 0.160848 0.221581 0.180853 -0.005208 0.104774
polarizability: 1.09412837e+02 7.75825946e+00 7.00862648e+01 1.64772353e-02 8.16126552e-03 4.93653536e+01
1716.lowfreq: -4.0906 -0.0026 -0.0015 -0.0011 6.9782 14.6183 31.7680 50.4611 69.0294
frequency: 31.6462 49.0841 69.0293 78.5184 115.2035 163.9483 171.3213 231.6520 233.7185 328.7988 415.9145 442.0114 475.1729 613.5987 767.0326 813.7601 824.7311 828.7114 897.0146 1002.7542 1070.0684 1073.8746 1090.0442 1099.8766 1134.3336 1139.1407 1170.7055 1251.0718 1254.7221 1309.2539 1358.1100 1394.0674 1414.1012 1460.2995 1472.1269 1477.9858 1486.2886 1496.6129 1697.9305 2926.5235 2945.3348 2976.6230 2996.8778 2998.0080 3036.1829 3094.3491 3104.9838 3115.2387
redmass: 4.4625 2.4660 5.3713 2.3573 2.8182 3.8435 5.2939 7.4511 1.1579 4.1770 11.5181 5.2189 4.0203 11.7510 10.1094 1.0877 1.0985 3.4877 5.7172 3.3200 11.2242 5.6798 2.5980 1.4357 2.4105 1.3977 1.1665 1.1408 1.1508 1.2228 1.3189 1.2452 1.4967 1.0402 1.0805 1.0615 1.0747 1.0794 12.1951 1.0553 1.0550 1.1071 1.0360 1.1073 1.0567 1.0989 1.1012 1.1106
irintensity: 0.1529 1.0793 0.2605 4.8670 1.9087 9.2444 1.2300 11.7992 0.9035 5.8271 2.6194 35.6793 5.6064 10.9868 95.7189 0.8782 4.7114 18.0636 6.4024 4.7189 744.8561 81.8114 9.2326 0.5480 5.5895 3.3972 9.0375 0.1104 0.0670 12.5255 12.3582 22.9747 5.2748 11.7669 2.7932 17.1975 1.1778 6.6818 345.9054 50.4310 65.8284 63.4591 20.3065 39.7859 10.2896 32.2352 35.2776 20.9611
temp: 298.150 k
press: 1.00000 atm
elementType: 17 8 8 8 6 6 6 6 6 1 1 1 1 1 1 1 1 1
symmnumber: 1
zpe: 362458.7 jmol-1
zpe.correction: 0.138053 hartree
zpe.thermalcorrener: 0.149125 hartree
zpe.thermalcorrenthalpy: 0.150069 hartree
zpe.thermalcorrgfe: 0.098841 hartree
zpe.sumelectzpe: -880.905398 hartree
zpe.sumelectthermal: -880.894327 hartree
zpe.sumelectthermalent: -880.893383 hartree
zpe.sumelectthermalfe: -880.944610 hartree
dipole: 4.0138 -1.7750 0.0104
dipole: 4.3888
quadrupole: -62.5972 -64.4867 -58.7497
quadrupole: -1.6006 0.0311 0.0011
quadrupole: -0.6526 -2.5422 3.1949 -1.6006 0.0311 0.0011
hfenergy: -881.0434516 hartree
pointgroup: C01 [X(C5H9Cl1O3)]
dipole: -1.6114024 -0.6202781 -0.0080937 debye
dipolederiv: -0.7159418 0.3575028 0.0025421 0.4548467 -0.4910452 -0.0028255 0.0030142 -0.0026393 -0.0835983 -1.3053922 -0.0017435 -0.0008363 -0.1036301 -0.4013784 0.0004457 -0.0018156 -0.0001367 -0.4276989 -1.8409074 -0.0256217 0.0004213 -0.3197429 -0.5094692 -0.001705 -0.0012058 -0.0016826 -0.2414936 -0.6726057 0.0250299 0.0003414 -0.1494152 -1.1084847 -0.0054125 -0.0008481 -0.0060531 -0.2510286 0.6551925 -0.1170089 -0.0005277 -0.2012893 0.2886938 -0.0016462 -0.0024769 -0.0013192 0.4282835 0.8602941 -0.0667629 -0.0007939 -0.2475542 0.2442748 -0.0006097 -0.0014309 -0.0005571 0.3421165 0.8842247 0.1068316 0.0016574 0.3376694 0.3333559 -0.0012396 0.0051685 -0.001068 0.446032 -0.1465054 0.0731086 0.0007861 0.0528945 0.0065473 -0.0003663 0.0002877 -0.0003782 0.0538725 2.3708755 -0.2951476 -0.0026802 0.1342895 1.7817037 0.0098858 -0.000135 0.0104012 0.2494617 -0.021908 0.0046463 0.0193789 0.0672741 -0.0459576 0.1032321 -0.0331652 0.1308771 -0.0996524 -0.0215646 0.0042492 -0.0201886 0.0659679 -0.0418075 -0.1022367 0.0338315 -0.1299257 -0.104106 -0.0145368 -0.0023715 -0.0304232 0.0487084 0.023229 -0.0660842 -0.0149093 -0.0775139 -0.0317476 -0.014741 -0.0030361 0.0304836 0.0483964 0.0209754 0.066923 0.0155199 0.078308 -0.0296913 -0.0498124 0.0209485 0.0363978 -0.0808886 -0.0661314 -0.1228403 -0.0271796 -0.1537639 -0.1228257 -0.0499584 0.0213021 -0.035423 -0.0820385 -0.0733152 0.1239429 0.025409 0.1550483 -0.1156875 -0.1360975 -0.0857065 -0.0015708 -0.1097894 0.0243777 -0.0014984 -0.0019472 -0.0014204 0.1138639 0.1096691 -0.0075071 -0.0244183 0.0423492 0.0102811 -0.1058338 0.0045098 -0.1194102 -0.0661956 0.1097154 -0.0087132 0.0248533 0.0419522 0.0041507 0.1078687 -0.002627 0.1212338 -0.0599045 unknown
polarizability: 108.561504|-9.6405678|70.9365304|-0.0740393|0.1521172|49.3664206 unknown
InChI: InChI=1S/C5H9ClO3/c1-2-8-3-4-9-5(6)7/h2-4H2,1H3
charge 0 multiplicity 1
18 atoms
Cl 4.015903 -1.012521 -0.010409
O  -2.145136 0.225402 0.003659
O  1.45976 -0.473431 -0.006007
O  2.814987 1.442682 0.006264
C  -0.945902 -0.612313 -0.006265
C  0.215875 0.376701 0.000295
C  -3.387839 -0.570002 -0.008049
C  -4.557459 0.411534 0.003029
C  2.637004 0.224142 -0.002231
H  -0.905148 -1.268165 0.889628
H  -0.909033 -1.252243 -0.913769
H  0.214762 1.006023 0.906092
H  0.214755 1.019132 -0.896207
H  -3.408299 -1.211625 -0.916838
H  -3.410718 -1.234685 0.883934
H  -5.517701 -0.135602 -0.006398
H  -4.523137 1.043991 0.906532
H  -4.519475 1.068379 -0.882758
