program: Orca
programVersion: 4.2.1
elementType: F F F O O N C C C C C C C C C C C C C C C C C H H H H H H H H H H H H H H H H
charge: 0
multiplicity: 1
keywords: wb97x-d3
keywords: def2-TZVPP
keywords: def2/J RIJCOSX GRIDX6 NOFINALGRIDX
keywords: grid4 nofinalgrid
keywords: scfconv7
keywords: smallprint printgap noloewdin
keywords: NOSOSCF
formula: C17H16F3NO2
InChI: InChI=1/C17H16F3NO2/c1-11(2)23-13-7-5-6-12(10-13)21-16(22)14-8-3-4-9-15(14)17(18,19)20/h3-11,21H,1-2H3
39 atoms
F  -2.354744 -2.186213 -0.2443
F  -3.765496 -1.653886 -1.770826
F  -1.821396 -0.743823 -1.750871
O  4.183049 0.972124 -0.302463
O  -0.494176 1.85602 -0.343709
N  -0.332026 -0.101377 0.815643
C  5.573358 0.67051 -0.476438
C  -2.489992 0.88842 0.47713
C  1.033457 -0.410818 0.748743
C  3.336641 0.052328 0.204873
C  -3.34847 -0.054217 -0.094519
C  1.99539 0.44457 0.22976
C  -1.005164 0.924234 0.252925
C  5.787547 -0.203097 -1.698906
C  6.280537 2.003543 -0.602371
C  1.409797 -1.65997 1.250341
C  3.716307 -1.192646 0.696441
C  -3.021889 1.911434 1.253073
C  -4.71561 0.023134 0.142955
C  2.738555 -2.031056 1.218027
C  -2.825151 -1.156738 -0.966689
C  -4.385017 1.980649 1.491775
C  -5.231508 1.033773 0.938317
H  5.951101 0.162299 0.416681
H  1.738073 1.418994 -0.153099
H  -0.886643 -0.767187 1.333219
H  6.849661 -0.419485 -1.815638
H  5.267347 -1.158926 -1.629835
H  5.446817 0.30429 -2.603013
H  5.931775 2.559036 -1.474527
H  7.352207 1.842339 -0.715961
H  6.130464 2.619881 0.284348
H  0.665944 -2.334277 1.6559
H  4.743845 -1.526301 0.687642
H  -2.363873 2.654818 1.683303
H  -5.393999 -0.695579 -0.294815
H  3.027628 -2.999807 1.602916
H  -4.783058 2.776696 2.105767
H  -6.296864 1.082647 1.115069
elementType: F O N C H
totalener: -1162.34330166 hartree
nucrepener: 1918.95133301 hartree
electener: -3081.29463467 hartree
oneelecener: -5404.73343027 hartree
twoeener: 2323.43879561 hartree
cpcmener: -0.03385866 hartree
kineticenergy: 1157.73625752 hartree
xcener: -106.860156553167 hartree
chargesum: -0.0000000
charge: -0.180183 -0.174033 -0.177446 -0.343378 -0.501329 -0.120443 0.160085 0.070368 0.191999 0.301937 -0.180127 -0.288139 0.419674 -0.263240 -0.260738 -0.249037 -0.238722 -0.210977 -0.064874 -0.159087 0.535927 -0.131734 -0.160924 0.069558 0.139566 0.177750 0.097754 0.095610 0.090251 0.089990 0.091588 0.097330 0.134813 0.143215 0.149990 0.150229 0.162205 0.167127 0.167447
qa: -0.1802 -0.1740 -0.1774 -0.3434 -0.5013 -0.1204 0.1601 0.0704 0.1920 0.3019 -0.1801 -0.2881 0.4197 -0.2632 -0.2607 -0.2490 -0.2387 -0.2110 -0.0649 -0.1591 0.5359 -0.1317 -0.1609 0.0696 0.1396 0.1778 0.0978 0.0956 0.0903 0.0900 0.0916 0.0973 0.1348 0.1432 0.1500 0.1502 0.1622 0.1671 0.1674
va: 1.1083 1.1312 1.1217 2.0717 1.9991 3.2572 3.8137 3.6702 3.8265 3.8829 3.8494 4.0756 3.9977 3.8987 3.9265 3.9546 3.8543 4.0102 3.8724 3.9599 4.4537 3.9057 3.9231 0.9990 1.0591 1.0069 1.0069 1.0049 1.0080 1.0074 1.0048 1.0081 1.0111 1.0063 1.0081 1.0067 0.9905 0.9871 0.9878
dispcorr: -0.017161202 hartree
energy: -1162.360462857727
dipole: 38.90298 -39.33816 -0.43518 9.42756 -10.44388 -1.01632 5.82721 -3.99352 1.83368
magnitude: 2.14119 au
magnitude: 5.44246 debye
