program: Orca
programVersion: 4.2.1
elementType: F F F O O N C C C C C C C C C C C C C C C C C H H H H H H H H H H H H H H H H
charge: 0
multiplicity: 1
keywords: wb97x-d3
keywords: def2-TZVPP
keywords: def2/J RIJCOSX GRIDX6 NOFINALGRIDX
keywords: grid4 nofinalgrid
keywords: scfconv7
keywords: smallprint printgap noloewdin
keywords: NOSOSCF
formula: C17H16F3NO2
InChI: InChI=1/C17H16F3NO2/c1-11(2)23-13-7-5-6-12(10-13)21-16(22)14-8-3-4-9-15(14)17(18,19)20/h3-11,21H,1-2H3
39 atoms
F  -2.487115 0.196678 -2.579475
F  -1.865934 -1.448185 -1.336793
F  -3.90159 -1.309004 -2.002257
O  4.537458 -0.202005 -0.237165
O  -0.229491 0.984891 -0.727524
N  -0.129276 -0.276408 1.174669
C  4.366843 0.867189 -1.17605
C  -2.219022 0.668357 0.525483
C  1.21049 -0.681832 1.234016
C  3.511818 -0.624153 0.531276
C  -3.215097 0.20608 -0.338034
C  2.203897 -0.160451 0.405063
C  -0.758634 0.471262 0.243581
C  4.346118 2.209452 -0.467625
C  5.518609 0.759582 -2.152498
C  1.52335 -1.647896 2.186723
C  3.827715 -1.594824 1.481848
C  -2.576295 1.394936 1.653621
C  -4.547785 0.47878 -0.061453
C  2.829893 -2.093907 2.298699
C  -2.86701 -0.586812 -1.563193
C  -3.90893 1.675391 1.918731
C  -4.893528 1.216351 1.061191
H  3.433443 0.721853 -1.729477
H  1.950265 0.591458 -0.321883
H  -0.72084 -0.677094 1.888904
H  4.185576 3.007005 -1.193446
H  3.550673 2.281083 0.274746
H  5.296497 2.39794 0.034583
H  6.479679 0.882357 -1.650639
H  5.433746 1.540752 -2.907491
H  5.516082 -0.200995 -2.668064
H  0.751867 -2.050411 2.831023
H  4.845898 -1.950437 1.570737
H  -1.80907 1.759616 2.323828
H  -5.332318 0.118356 -0.711838
H  3.072421 -2.847114 3.036304
H  -4.172206 2.250728 2.795354
H  -5.93509 1.423336 1.263435
elementType: F O N C H
totalener: -1162.34449536 hartree
nucrepener: 1928.85664225 hartree
electener: -3091.20113760 hartree
oneelecener: -5424.61579035 hartree
twoeener: 2333.41465275 hartree
cpcmener: -0.03423290 hartree
kineticenergy: 1157.74218123 hartree
xcener: -106.861881449961 hartree
chargesum: 0.0000000
charge: -0.175120 -0.180780 -0.178326 -0.345012 -0.492651 -0.108469 0.160418 0.032742 0.097049 0.315592 -0.167303 -0.217923 0.423020 -0.265789 -0.259365 -0.257985 -0.292192 -0.213382 -0.051734 -0.093682 0.526567 -0.118537 -0.173290 0.068397 0.137393 0.181278 0.099513 0.097320 0.090213 0.090158 0.091378 0.097433 0.139353 0.141888 0.155465 0.151235 0.160396 0.167030 0.167703
qa: -0.1751 -0.1808 -0.1783 -0.3450 -0.4927 -0.1085 0.1604 0.0327 0.0970 0.3156 -0.1673 -0.2179 0.4230 -0.2658 -0.2594 -0.2580 -0.2922 -0.2134 -0.0517 -0.0937 0.5266 -0.1185 -0.1733 0.0684 0.1374 0.1813 0.0995 0.0973 0.0902 0.0902 0.0914 0.0974 0.1394 0.1419 0.1555 0.1512 0.1604 0.1670 0.1677
va: 1.1179 1.1161 1.1234 2.0778 2.0094 3.2697 3.8139 3.6950 3.9368 3.8110 3.8282 3.8438 3.9492 3.8987 3.9221 3.9441 4.0062 3.9913 3.8501 3.9042 4.4753 3.9039 3.9303 1.0004 1.0463 0.9991 1.0066 1.0040 1.0080 1.0076 1.0050 1.0082 1.0079 1.0119 1.0060 1.0062 0.9870 0.9872 0.9878
dispcorr: -0.016990762 hartree
energy: -1162.361486116825
dipole: 33.02155 -34.42288 -1.40133 11.05723 -10.67201 0.38522 10.50939 -8.16100 2.34839
magnitude: 2.76171 au
magnitude: 7.01972 debye
