program: Orca
programVersion: 4.2.1
elementType: F F F O O N C C C C C C C C C C C C C C C C C H H H H H H H H H H H H H H H H
charge: 0
multiplicity: 1
keywords: wb97x-d3
keywords: def2-TZVPP
keywords: def2/J RIJCOSX GRIDX6 NOFINALGRIDX
keywords: grid4 nofinalgrid
keywords: scfconv7
keywords: smallprint printgap noloewdin
keywords: NOSOSCF
formula: C17H16F3NO2
InChI: InChI=1/C17H16F3NO2/c1-11(2)23-13-7-5-6-12(10-13)21-16(22)14-8-3-4-9-15(14)17(18,19)20/h3-11,21H,1-2H3
39 atoms
F  -3.477805 2.849284 0.343255
F  -1.511465 2.057946 0.67256
F  -2.231957 2.369243 -1.334079
O  4.529915 -0.188666 -0.147271
O  -0.289662 0.108565 -1.155096
N  -0.175463 -1.017619 0.827679
C  4.274965 0.54688 -1.350762
C  -2.315933 -0.553101 -0.115389
C  1.199882 -1.144105 1.062279
C  3.518307 -0.728008 0.564407
C  -3.153294 0.566505 -0.122858
C  2.171485 -0.565801 0.245365
C  -0.823051 -0.437643 -0.205014
C  5.505437 1.39353 -1.599354
C  3.99034 -0.39308 -2.508626
C  1.571314 -1.880722 2.184525
C  3.893396 -1.467382 1.68596
C  -2.877915 -1.823475 -0.101359
C  -4.530688 0.396362 -0.124578
C  2.915119 -2.033061 2.483199
C  -2.591746 1.958271 -0.112779
C  -4.255417 -1.987804 -0.113439
C  -5.080853 -0.877315 -0.127329
H  3.424024 1.217537 -1.194106
H  1.870411 0.003973 -0.616357
H  -0.76127 -1.414615 1.548199
H  5.358816 1.998559 -2.493693
H  5.697395 2.072571 -0.768292
H  6.391042 0.775413 -1.755101
H  3.777429 0.184641 -3.408206
H  3.130621 -1.038714 -2.326464
H  4.853456 -1.028485 -2.71387
H  0.816446 -2.331402 2.816674
H  4.941584 -1.587415 1.92687
H  -2.237662 -2.695895 -0.100377
H  -5.193003 1.250461 -0.117501
H  3.203747 -2.605088 3.354794
H  -4.676767 -2.983538 -0.111942
H  -6.155567 -0.993816 -0.132779
elementType: F O N C H
totalener: -1162.34448745 hartree
nucrepener: 1930.36146658 hartree
electener: -3092.70595403 hartree
oneelecener: -5427.66215363 hartree
twoeener: 2334.95619960 hartree
cpcmener: -0.03393993 hartree
kineticenergy: 1157.74147627 hartree
xcener: -106.862251123538 hartree
chargesum: -0.0000000
charge: -0.179237 -0.181114 -0.174966 -0.344788 -0.493439 -0.106017 0.162681 0.034362 0.104059 0.310603 -0.182143 -0.220636 0.430134 -0.259429 -0.265326 -0.261121 -0.294468 -0.197676 -0.055085 -0.093424 0.530222 -0.130637 -0.164521 0.070203 0.138009 0.180251 0.090735 0.097678 0.090228 0.098516 0.094128 0.091048 0.139724 0.141637 0.156264 0.148864 0.160963 0.166782 0.166934
qa: -0.1792 -0.1811 -0.1750 -0.3448 -0.4934 -0.1060 0.1627 0.0344 0.1041 0.3106 -0.1821 -0.2206 0.4301 -0.2594 -0.2653 -0.2611 -0.2945 -0.1977 -0.0551 -0.0934 0.5302 -0.1306 -0.1645 0.0702 0.1380 0.1803 0.0907 0.0977 0.0902 0.0985 0.0941 0.0910 0.1397 0.1416 0.1563 0.1489 0.1610 0.1668 0.1669
va: 1.1214 1.1162 1.1177 2.0781 2.0109 3.2749 3.8084 3.6747 3.9380 3.8187 3.8260 3.8368 3.9643 3.9221 3.8999 3.9467 4.0062 3.9873 3.8555 3.9063 4.4672 3.9186 3.9275 0.9994 1.0516 1.0005 1.0052 1.0081 1.0072 1.0069 1.0071 1.0077 1.0081 1.0119 1.0062 1.0071 0.9868 0.9875 0.9880
dispcorr: -0.016955102 hartree
energy: -1162.361442551930
dipole: 29.91725 -31.58410 -1.66685 -15.54673 13.68937 -1.85736 -5.41711 6.42888 1.01177
magnitude: 2.69293 au
magnitude: 6.84487 debye
