program: Gaussian 09
title: 000069407
version: EM64L-G09RevD.01
frameworkgroup: C1[X(C6H14N2O)]
method: RPBEPBE
basis: SDD
operation: Freq
keyword: #p
keyword: freq=noraman
keyword: PBEPBE/SDD
title: #p freq=noraman PBEPBE/SDD
converged: YES YES NO NO
title: Mulliken charges:
elementType: O N N C C C C C C H H H H H H H H H H H H H H
charge: -0.308516 -0.380371 -0.651992 -0.021085 -0.366670 -0.396950 -0.715571 -0.708054 0.270188 0.199583 0.220498 0.176092 0.223133 0.267571 0.212054 0.208846 0.215235 0.221852 0.207937 0.214315 0.276553 0.296951 0.338401
chargesum: 0.00000
title: Mulliken charges with hydrogens summed into heavy atoms:
elementType: O N N C C C C C C
charge: -0.308516 -0.103818 -0.016640 0.178498 0.029921 0.093754 -0.079437 -0.063950 0.270188
polarizability: 1.03158889e+02 3.16700765e-01 8.23898626e+01 4.08779343e+00 -1.72870375e+00 6.24306852e+01
1716.lowfreq: -20.1469 -9.4191 -5.9613 -0.0012 -0.0009 -0.0006 19.7676 34.8351 77.8536
frequency: 17.2795 34.6020 77.8142 90.1903 187.5963 217.3351 235.2702 244.5275 282.2680 318.2490 358.1068 375.7491 455.2642 462.2354 516.4238 547.0201 629.1990 713.9286 764.6412 789.1758 884.9064 911.5571 953.6389 956.7315 990.1978 996.3041 1035.1939 1122.6933 1139.5343 1152.9171 1190.9514 1223.4995 1281.9076 1298.5231 1314.3316 1334.1898 1342.8317 1375.4535 1376.8598 1394.7206 1453.5839 1465.0276 1470.2238 1476.9721 1484.0767 1490.2277 1507.1360 1599.7012 1650.1991 2951.9682 2967.5031 2969.8592 2975.7775 2992.5273 3026.2581 3063.6266 3064.6091 3071.1094 3073.4497 3081.8997 3542.1812 3554.2651 3702.5610
redmass: 3.9610 3.7191 3.8487 2.0611 2.8202 1.0990 1.2355 1.0338 2.5107 3.0930 2.1489 2.3757 1.2719 2.2683 1.1957 2.6246 3.3933 9.2196 1.2846 3.0068 2.4624 1.2300 1.3707 2.0812 2.0311 1.7621 1.9205 2.0351 2.2192 2.5744 1.9063 1.2433 1.5478 1.2091 1.7861 1.4103 1.3570 1.3577 1.2375 1.2190 1.0795 1.0466 1.1220 1.0619 1.0536 1.0566 2.0722 1.3175 3.6463 1.0693 1.0615 1.0457 1.0406 1.0664 1.0955 1.0997 1.0997 1.0992 1.0992 1.0985 1.0496 1.0729 1.1037
irintensity: 8.3653 3.9120 9.4248 0.1889 1.7061 0.0458 10.9670 0.3493 13.6011 4.3452 0.6091 3.1134 340.2971 75.5674 40.4675 13.3869 3.6348 17.2871 7.7485 3.0684 1.7035 2.5324 0.1488 2.5177 1.5859 0.7909 10.4331 12.9424 1.7014 8.9989 8.9505 10.1423 2.8475 2.6730 216.8504 2.5638 16.1251 9.4744 21.5712 12.0587 12.2131 4.0425 20.2322 6.5042 14.7984 10.0268 344.6047 105.9835 272.1072 20.8213 50.0903 53.8237 6.2348 43.1488 36.2525 25.2565 15.4415 93.7923 66.9123 7.5884 33.7867 5.4097 34.5490
temp: 298.150 k
press: 1.00000 atm
elementType: 8 7 7 6 6 6 6 6 6 1 1 1 1 1 1 1 1 1 1 1 1 1 1
symmnumber: 1
zpe: 527724.0 jmol-1
zpe.correction: 0.200999 hartree
zpe.thermalcorrener: 0.212641 hartree
zpe.thermalcorrenthalpy: 0.213585 hartree
zpe.thermalcorrgfe: 0.162081 hartree
zpe.sumelectzpe: -421.040851 hartree
zpe.sumelectthermal: -421.029210 hartree
zpe.sumelectthermalent: -421.028266 hartree
zpe.sumelectthermalfe: -421.079769 hartree
dipole: 0.2483 -4.2752 0.8893
dipole: 4.3738
quadrupole: -46.4048 -57.2261 -58.2494
quadrupole: -10.2180 2.7122 0.2500
quadrupole: 7.5553 -3.2660 -4.2893 -10.2180 2.7122 0.2500
hfenergy: -421.2418505 hartree
pointgroup: C01 [X(C6H14N2O1)]
dipole: 0.0912684 1.6250391 -0.5585336 debye
dipolederiv: -0.7274772 -0.0106008 0.0374432 0.0803969 -1.0424135 0.1933581 0.0212645 0.1795784 -0.4441515 -1.246161 0.2469681 -0.0751869 0.4803099 -0.5302525 -0.1017868 -0.0749579 -0.1315088 -0.4691004 -1.2876397 -0.2430822 0.1114393 -0.3046472 -0.3371099 -0.0235772 0.2005934 -0.0327811 -0.8090727 0.1813786 -0.0018399 0.0012108 0.0020832 0.1490466 0.0102863 -0.0381734 0.0181728 0.1451501 -0.0795223 -0.0076881 0.0050943 -0.0343413 0.1312251 -0.0254701 0.0060792 -0.0577262 0.041975 0.6411018 -0.016136 -0.0017385 0.1636999 0.10314 0.0818676 -0.0769123 0.1406547 0.231838 -0.0146 0.0407218 0.0621303 0.0256829 -0.0276091 -0.0566808 0.0754465 -0.0447603 0.0410607 0.0192958 -0.0027022 0.0297311 0.0012662 -0.0776855 0.0518828 0.0474296 0.0419301 0.0512079 2.1268106 -0.0770444 -0.2416067 -0.3639775 1.4208887 -0.2978916 -0.2391536 -0.2843388 0.4267769 -0.0667761 -0.0007693 -0.0985477 -0.0103524 0.0266822 -0.0081392 -0.1041331 -0.0094738 -0.1705302 -0.0074049 0.0588796 0.0630373 0.0698646 -0.0225195 -0.1184427 0.0422614 -0.084008 -0.0384035 0.0278726 -0.0333396 -0.0093018 -0.0444259 -0.1655368 0.1450791 -0.0184843 0.0912777 -0.0085564 -0.0516189 0.0548241 0.0606057 0.0613285 -0.0141768 -0.1268893 0.0710956 -0.1047387 -0.0459129 0.1294999 0.0142913 -0.0154533 -0.0600778 0.0081592 0.0728285 0.0036063 0.0411705 0.0446404 0.0597514 -0.0043741 -0.11666 0.0172837 0.0681653 0.004902 -0.0875392 -0.0332996 -0.1353836 0.1026898 -0.0368976 0.0240847 0.0058573 -0.1742485 0.0733583 0.0063017 0.1035782 0.0322692 -0.2118278 -0.0218388 0.042908 -0.0730532 0.0779941 -0.0039341 0.0247582 -0.0083454 0.0811749 0.0452402 0.1175774 0.0711781 0.0864373 -0.0587657 -0.0695219 0.0649165 -0.09699 0.0081783 -0.1899671 -0.116653 0.0310082 -0.0701776 0.0511266 0.0236971 0.0215004 0.0224295 0.0841545 0.0635394 0.011186 -0.1051154 -0.0084963 0.0615707 -0.0313606 -0.1022541 0.0156436 -0.1249125 0.093942 0.0159598 0.0441599 -0.0117141 0.0923467 0.0867125 0.0882573 0.1199281 0.2932728 0.1808929 0.0087056 0.0469721 -0.0095643 0.085926 0.067709 0.0372198 0.058832 0.380882 0.2109801 0.0038523 0.0326072 -0.0033829 0.1740464 0.0520131 0.0308773 0.0547752 0.3834432 unknown
polarizability: 103.2040463|-0.6893788|81.6326089|-3.8042418|-4.1934439|63.1427814 unknown
InChI: InChI=1S/C6H14N2O/c1-5(2)3-4-8-6(7)9/h5,8H,3-4,7H2,1-2H3
charge 0 multiplicity 1
23 atoms
O  2.189564 -1.301877 0.501691
N  1.303427 0.837989 0.132266
N  3.593518 0.41164 -0.227017
C  -2.464731 -0.048304 -0.464336
C  -0.991207 0.349217 -0.76805
C  -0.073919 0.45137 0.47489
C  -3.202615 1.018777 0.383038
C  -2.569598 -1.447532 0.191569
C  2.34501 -0.089418 0.156531
H  -2.978748 -0.102039 -1.447615
H  -0.546323 -0.395104 -1.457525
H  -0.989192 1.323916 -1.301351
H  -0.483725 1.177429 1.203096
H  0.004518 -0.527996 0.975584
H  -2.799152 1.069324 1.41176
H  -3.112502 2.024882 -0.069076
H  -4.279129 0.778591 0.463734
H  -2.03284 -2.210338 -0.402246
H  -3.626523 -1.76171 0.277864
H  -2.138312 -1.449817 1.209764
H  1.465576 1.781004 -0.222457
H  3.771035 1.387666 -0.452953
H  4.37027 -0.24347 -0.212663
