program: Orca
programVersion: 4.2.1
elementType: F F F O O N C C C C C C C C C C C C C C C C C H H H H H H H H H H H H H H H H
charge: 0
multiplicity: 1
keywords: wb97x-d3
keywords: def2-TZVPP
keywords: def2/J RIJCOSX GRIDX6 NOFINALGRIDX
keywords: grid4 nofinalgrid
keywords: scfconv7
keywords: smallprint printgap noloewdin
keywords: NOSOSCF
formula: C17H16F3NO2
InChI: InChI=1/C17H16F3NO2/c1-11(2)23-13-7-5-6-12(10-13)21-16(22)14-8-3-4-9-15(14)17(18,19)20/h3-11,21H,1-2H3
39 atoms
F  -3.5114 -0.819737 -2.422349
F  -2.15302 0.837919 -2.442333
F  -1.554783 -1.03825 -1.570115
O  4.522174 -0.049947 -0.009399
O  -0.207632 1.249889 -0.250331
N  -0.144112 -0.376425 1.351775
C  4.265316 0.84591 -1.0984
C  -2.253409 0.530008 0.699171
C  1.217715 -0.690378 1.448433
C  3.515779 -0.529363 0.749942
C  -3.113895 0.253969 -0.367415
C  2.187361 -0.135828 0.611708
C  -0.763269 0.505447 0.539301
C  5.589395 1.505189 -1.419315
C  3.700084 0.103422 -2.295664
C  1.575523 -1.622773 2.418781
C  3.879175 -1.461284 1.722201
C  -2.783808 0.910063 1.925155
C  -4.485939 0.37102 -0.192369
C  2.904586 -1.994953 2.5454
C  -2.581634 -0.188068 -1.699385
C  -4.155751 1.033937 2.09134
C  -5.005262 0.766854 1.031637
H  3.563584 1.621044 -0.773593
H  1.896608 0.584942 -0.132564
H  -0.747891 -0.924969 1.947649
H  6.331216 0.772279 -1.742172
H  5.45763 2.223879 -2.227799
H  5.986724 2.044597 -0.558955
H  3.518494 0.805056 -3.110403
H  2.753703 -0.393728 -2.081154
H  4.403555 -0.650422 -2.653689
H  0.823216 -2.056961 3.065456
H  4.915558 -1.75672 1.824668
H  -2.122952 1.129571 2.753843
H  -5.167113 0.150692 -1.002328
H  3.183467 -2.718996 3.299508
H  -4.556021 1.338956 3.048432
H  -6.075766 0.856545 1.15377
elementType: F O N C H
totalener: -1162.34436752 hartree
nucrepener: 1938.53320274 hartree
electener: -3100.87757026 hartree
oneelecener: -5444.02262642 hartree
twoeener: 2343.14505615 hartree
cpcmener: -0.03395272 hartree
kineticenergy: 1157.74238222 hartree
xcener: -106.862534078928 hartree
chargesum: -0.0000000
charge: -0.179176 -0.175788 -0.181121 -0.343896 -0.497149 -0.105783 0.159084 0.031670 0.104441 0.309940 -0.189623 -0.225350 0.436821 -0.261389 -0.263853 -0.260308 -0.291970 -0.187977 -0.057832 -0.093939 0.533826 -0.134494 -0.164093 0.070027 0.139191 0.180269 0.090002 0.091791 0.097615 0.098981 0.094882 0.090958 0.140292 0.141948 0.157978 0.149889 0.159995 0.166685 0.167456
qa: -0.1792 -0.1758 -0.1811 -0.3439 -0.4971 -0.1058 0.1591 0.0317 0.1044 0.3099 -0.1896 -0.2254 0.4368 -0.2614 -0.2639 -0.2603 -0.2920 -0.1880 -0.0578 -0.0939 0.5338 -0.1345 -0.1641 0.0700 0.1392 0.1803 0.0900 0.0918 0.0976 0.0990 0.0949 0.0910 0.1403 0.1419 0.1580 0.1499 0.1600 0.1667 0.1675
va: 1.1219 1.1171 1.1157 2.0795 2.0066 3.2771 3.8146 3.6795 3.9371 3.8216 3.8309 3.8363 3.9555 3.9242 3.8958 3.9465 4.0060 3.9797 3.8563 3.9048 4.4616 3.9197 3.9229 0.9996 1.0501 1.0002 1.0071 1.0049 1.0081 1.0069 1.0066 1.0082 1.0078 1.0116 1.0052 1.0066 0.9871 0.9876 0.9876
dispcorr: -0.017068963 hartree
energy: -1162.361436486550
dipole: 29.47656 -31.14837 -1.67182 3.79813 -4.25907 -0.46095 8.60310 -6.60486 1.99824
magnitude: 2.64583 au
magnitude: 6.72517 debye
