program: Orca
programVersion: 4.2.1
elementType: F F F O O N C C C C C C C C C C C C C C C C C H H H H H H H H H H H H H H H H
charge: 0
multiplicity: 1
keywords: wb97x-d3
keywords: def2-TZVPP
keywords: def2/J RIJCOSX GRIDX6 NOFINALGRIDX
keywords: grid4 nofinalgrid
keywords: scfconv7
keywords: smallprint printgap noloewdin
keywords: NOSOSCF
formula: C17H16F3NO2
InChI: InChI=1/C17H16F3NO2/c1-11(2)23-13-7-5-6-12(10-13)21-16(22)14-8-3-4-9-15(14)17(18,19)20/h3-11,21H,1-2H3
39 atoms
F  -3.539043 -0.897372 2.396032
F  -2.346113 -1.970977 0.971499
F  -1.524524 -0.269021 2.003269
O  4.532917 0.005756 0.062284
O  -0.083895 1.700393 -0.132044
N  -0.247823 -0.498154 -0.725962
C  4.452394 1.383289 0.441962
C  -2.241332 0.81656 -0.523099
C  1.077613 -0.950848 -0.70482
C  3.438089 -0.679502 -0.313701
C  -3.129562 0.159026 0.331866
C  2.149262 -0.15014 -0.308833
C  -0.744968 0.721385 -0.420657
C  5.706063 1.673214 1.240886
C  4.340427 2.278635 -0.779986
C  1.292456 -2.268433 -1.101796
C  3.656296 -1.998804 -0.711878
C  -2.741425 1.668465 -1.500911
C  -4.499116 0.338308 0.174795
C  2.581277 -2.776934 -1.098788
C  -2.635854 -0.741111 1.426601
C  -4.107432 1.83742 -1.658159
C  -4.986368 1.16885 -0.821422
H  3.586333 1.532718 1.095793
H  1.967003 0.866065 -0.005255
H  -0.916192 -1.179361 -1.053863
H  5.69283 2.706006 1.589427
H  5.777694 1.02893 2.118045
H  6.604759 1.535874 0.636511
H  3.4609 2.060209 -1.387149
H  5.221591 2.179539 -1.416677
H  4.26659 3.321462 -0.469151
H  0.462103 -2.89264 -1.408868
H  4.661332 -2.401088 -0.710612
H  -2.055939 2.194521 -2.152726
H  -5.199651 -0.159931 0.830606
H  2.748695 -3.801538 -1.404466
H  -4.482429 2.49526 -2.43069
H  -6.054122 1.29912 -0.933628
elementType: F O N C H
totalener: -1162.35307450 hartree
nucrepener: 1943.26904305 hartree
electener: -3105.62211755 hartree
oneelecener: -5452.98053543 hartree
twoeener: 2347.35841788 hartree
cpcmener: -0.02506325 hartree
kineticenergy: 1157.73459811 hartree
xcener: -106.859182338185 hartree
chargesum: -0.0000000
charge: -0.174080 -0.180172 -0.175191 -0.328863 -0.472418 -0.114472 0.157609 0.072220 0.110177 0.310012 -0.193671 -0.223155 0.405210 -0.260622 -0.262439 -0.260918 -0.290635 -0.192653 -0.067127 -0.090517 0.537626 -0.137328 -0.155039 0.068294 0.139704 0.170321 0.089944 0.097593 0.089754 0.093725 0.089820 0.097537 0.132626 0.137637 0.147644 0.148434 0.156390 0.162987 0.164037
qa: -0.1741 -0.1802 -0.1752 -0.3289 -0.4724 -0.1145 0.1576 0.0722 0.1102 0.3100 -0.1937 -0.2232 0.4052 -0.2606 -0.2624 -0.2609 -0.2906 -0.1927 -0.0671 -0.0905 0.5376 -0.1373 -0.1550 0.0683 0.1397 0.1703 0.0899 0.0976 0.0898 0.0937 0.0898 0.0975 0.1326 0.1376 0.1476 0.1484 0.1564 0.1630 0.1640
va: 1.1311 1.1084 1.1249 2.0966 2.0388 3.2468 3.8183 3.6648 3.9252 3.8360 3.8454 3.8487 4.0223 3.9232 3.8979 3.9603 4.0118 4.0036 3.8825 3.9185 4.4559 3.9189 3.9240 0.9997 1.0513 1.0103 1.0053 1.0081 1.0075 1.0079 1.0079 1.0069 1.0106 1.0132 1.0094 1.0073 0.9886 0.9888 0.9890
dispcorr: -0.017517723 hartree
energy: -1162.370592221103
dipole: 31.22321 -32.82810 -1.60489 12.99589 -13.03688 -0.04099 -11.93263 10.62608 -1.30655
magnitude: 2.06988 au
magnitude: 5.26122 debye
