program: Orca
programVersion: 4.2.1
elementType: F F F O O N C C C C C C C C C C C C C C C C C H H H H H H H H H H H H H H H H
charge: 0
multiplicity: 1
keywords: wb97x-d3
keywords: def2-TZVPP
keywords: def2/J RIJCOSX GRIDX6 NOFINALGRIDX
keywords: grid4 nofinalgrid
keywords: scfconv7
keywords: smallprint printgap noloewdin
keywords: NOSOSCF
formula: C17H16F3NO2
InChI: InChI=1/C17H16F3NO2/c1-11(2)23-13-7-5-6-12(10-13)21-16(22)14-8-3-4-9-15(14)17(18,19)20/h3-11,21H,1-2H3
39 atoms
F  -3.987338 -2.403094 -0.309504
F  -1.933837 -1.832306 -0.572033
F  -2.745869 -2.066646 1.407551
O  4.178362 0.012796 0.852088
O  -0.554175 0.046662 1.421646
N  -0.252907 0.889865 -0.678183
C  5.581337 -0.210104 0.67963
C  -2.45353 0.834568 0.241742
C  1.122424 0.743094 -0.894957
C  3.390049 0.301303 -0.199619
C  -3.421128 -0.171022 0.180813
C  2.031002 0.423186 0.104779
C  -0.989781 0.533278 0.39707
C  6.214381 0.008967 2.038059
C  5.842628 -1.607867 0.148057
C  1.570372 0.947713 -2.203613
C  3.83888 0.491991 -1.503304
C  -2.84947 2.165399 0.234099
C  -4.765676 0.168382 0.119589
C  2.91442 0.819242 -2.487706
C  -3.022997 -1.61763 0.178615
C  -4.195073 2.49963 0.184399
C  -5.151841 1.500785 0.128603
H  5.987941 0.534511 -0.013125
H  1.717523 0.271832 1.125797
H  -0.773197 1.219154 -1.478386
H  5.837817 -0.702764 2.775041
H  7.294267 -0.122429 1.968322
H  6.027295 1.018489 2.405984
H  6.914394 -1.761219 0.016251
H  5.369249 -1.786371 -0.81817
H  5.479188 -2.363843 0.846654
H  0.868354 1.19864 -2.989429
H  4.880638 0.397309 -1.77434
H  -2.103314 2.948343 0.282611
H  -5.527463 -0.596602 0.060979
H  3.258809 0.971509 -3.502302
H  -4.491032 3.540065 0.190886
H  -6.202881 1.751922 0.0862
elementType: F O N C H
totalener: -1162.35419708 hartree
nucrepener: 1905.16446265 hartree
electener: -3067.51865973 hartree
oneelecener: -5377.32399448 hartree
twoeener: 2309.80533476 hartree
cpcmener: -0.03076439 hartree
kineticenergy: 1157.73957911 hartree
xcener: -106.858989987563 hartree
chargesum: 0.0000000
charge: -0.178147 -0.179475 -0.172066 -0.327572 -0.457049 -0.120817 0.151324 0.026073 0.168537 0.302493 -0.159789 -0.273584 0.405501 -0.256659 -0.259080 -0.242184 -0.238329 -0.206830 -0.055275 -0.160116 0.525540 -0.120680 -0.169301 0.066561 0.136970 0.176785 0.090207 0.089397 0.096388 0.095791 0.093862 0.090269 0.136200 0.139119 0.151182 0.149145 0.158215 0.163428 0.163967
qa: -0.1781 -0.1795 -0.1721 -0.3276 -0.4570 -0.1208 0.1513 0.0261 0.1685 0.3025 -0.1598 -0.2736 0.4055 -0.2567 -0.2591 -0.2422 -0.2383 -0.2068 -0.0553 -0.1601 0.5255 -0.1207 -0.1693 0.0666 0.1370 0.1768 0.0902 0.0894 0.0964 0.0958 0.0939 0.0903 0.1362 0.1391 0.1512 0.1491 0.1582 0.1634 0.1640
va: 1.1239 1.1173 1.1234 2.0876 2.0451 3.2588 3.8301 3.7065 3.8683 3.8841 3.8337 4.0576 3.9698 3.9270 3.8998 3.9433 3.8525 3.9946 3.8572 3.9640 4.4773 3.9101 3.9345 0.9989 1.0571 1.0024 1.0075 1.0053 1.0086 1.0070 1.0060 1.0079 1.0081 1.0078 1.0067 1.0070 0.9915 0.9882 0.9890
dispcorr: -0.016696109 hartree
energy: -1162.370893189161
dipole: 40.76818 -40.91675 -0.14857 12.17599 -10.25904 1.91695 -1.38234 -0.58404 -1.96638
magnitude: 2.75017 au
magnitude: 6.99037 debye
