program: Orca
programVersion: 4.2.1
elementType: F F F O O N C C C C C C C C C C C C C C C C C H H H H H H H H H H H H H H H H
charge: 0
multiplicity: 1
keywords: wb97x-d3
keywords: def2-TZVPP
keywords: def2/J RIJCOSX GRIDX6 NOFINALGRIDX
keywords: grid4 nofinalgrid
keywords: scfconv7
keywords: smallprint printgap noloewdin
keywords: NOSOSCF
formula: C17H16F3NO2
InChI: InChI=1/C17H16F3NO2/c1-11(2)23-13-7-5-6-12(10-13)21-16(22)14-8-3-4-9-15(14)17(18,19)20/h3-11,21H,1-2H3
39 atoms
F  -2.116366 -1.677603 1.229888
F  -4.159044 -1.406778 1.829865
F  -3.717639 -2.126154 -0.140993
O  4.882956 0.304176 0.337578
O  -1.260902 -1.228361 -1.578504
N  0.151693 0.123109 -0.399178
C  4.814786 1.555451 1.029062
C  -2.183008 0.625422 -0.428201
C  1.4108 -0.447667 -0.62444
C  3.785247 -0.261108 -0.195087
C  -3.276183 0.149254 0.301347
C  2.492655 0.225343 -0.045799
C  -1.057618 -0.271046 -0.857956
C  6.081615 1.644929 1.854869
C  4.692207 2.709674 0.04989
C  1.620989 -1.609494 -1.360192
C  3.99968 -1.429174 -0.931328
C  -2.170336 1.948398 -0.851293
C  -4.338004 0.997107 0.584153
C  2.922298 -2.07963 -1.496672
C  -3.316713 -1.266078 0.80083
C  -3.238647 2.789214 -0.574039
C  -4.323172 2.311753 0.140697
H  3.957852 1.550652 1.71169
H  2.296782 1.127773 0.519707
H  0.149889 0.917762 0.223571
H  6.087814 2.572875 2.426669
H  6.154583 0.818829 2.563195
H  6.97081 1.636791 1.221595
H  3.794994 2.647488 -0.56712
H  5.557132 2.748009 -0.614946
H  4.6457 3.653714 0.594006
H  0.808784 -2.148639 -1.816632
H  5.004821 -1.813915 -1.048408
H  -1.329152 2.323741 -1.420526
H  -5.18693 0.648168 1.155541
H  3.091531 -2.985261 -2.064835
H  -3.219627 3.813964 -0.919928
H  -5.160557 2.958928 0.363512
elementType: F O N C H
totalener: -1162.35397963 hartree
nucrepener: 1906.60206815 hartree
electener: -3068.95604777 hartree
oneelecener: -5379.47911872 hartree
twoeener: 2310.52307095 hartree
cpcmener: -0.03137272 hartree
kineticenergy: 1157.73301787 hartree
xcener: -106.858551976399 hartree
chargesum: 0.0000000
charge: -0.180000 -0.179394 -0.171786 -0.329960 -0.459828 -0.120535 0.155367 0.026278 0.124482 0.314948 -0.176844 -0.205820 0.416918 -0.258448 -0.262168 -0.270548 -0.284546 -0.200958 -0.055530 -0.115952 0.528919 -0.126034 -0.165920 0.066868 0.116589 0.174962 0.089119 0.097367 0.090117 0.095139 0.090841 0.096692 0.155624 0.138423 0.154650 0.148332 0.154977 0.163700 0.163956
qa: -0.1800 -0.1794 -0.1718 -0.3300 -0.4598 -0.1205 0.1554 0.0263 0.1245 0.3149 -0.1768 -0.2058 0.4169 -0.2584 -0.2622 -0.2705 -0.2845 -0.2010 -0.0555 -0.1160 0.5289 -0.1260 -0.1659 0.0669 0.1166 0.1750 0.0891 0.0974 0.0901 0.0951 0.0908 0.0967 0.1556 0.1384 0.1547 0.1483 0.1550 0.1637 0.1640
va: 1.1176 1.1213 1.1226 2.0925 2.0461 3.2693 3.8239 3.6827 3.9035 3.8204 3.8332 3.8446 3.9790 3.9261 3.8996 3.9653 4.0093 3.9908 3.8590 3.9378 4.4697 3.9198 3.9328 0.9995 1.0225 1.0057 1.0057 1.0081 1.0073 1.0049 1.0081 1.0072 1.0374 1.0126 1.0067 1.0070 0.9908 0.9887 0.9892
dispcorr: -0.016724700 hartree
energy: -1162.370704329923
dipole: 40.88908 -40.54954 0.33954 24.02858 -20.49039 3.53819 -0.58236 1.71338 1.13101
magnitude: 3.73005 au
magnitude: 9.48103 debye
