program: Orca
programVersion: 4.2.1
elementType: F F F O O N C C C C C C C C C C C C C C C C C H H H H H H H H H H H H H H H H
charge: 0
multiplicity: 1
keywords: wb97x-d3
keywords: def2-TZVPP
keywords: def2/J RIJCOSX GRIDX6 NOFINALGRIDX
keywords: grid4 nofinalgrid
keywords: scfconv7
keywords: smallprint printgap noloewdin
keywords: NOSOSCF
formula: C17H16F3NO2
InChI: InChI=1/C17H16F3NO2/c1-11(2)23-13-7-5-6-12(10-13)21-16(22)14-8-3-4-9-15(14)17(18,19)20/h3-11,21H,1-2H3
39 atoms
F  -3.675425 -1.772474 -1.364373
F  -2.119422 -1.996325 0.109545
F  -4.175646 -2.274543 0.65997
O  4.450857 0.605081 1.087272
O  -1.312216 -0.014407 -1.971146
N  -0.059212 0.566566 -0.152971
C  5.847665 0.319176 0.948057
C  -2.429744 0.819866 -0.053842
C  1.254127 0.304551 -0.56206
C  3.588375 0.314996 0.096119
C  -3.464562 -0.068141 0.253308
C  2.246405 0.548738 0.383092
C  -1.216143 0.39846 -0.832529
C  6.557487 1.170944 1.980416
C  6.118762 -1.161412 1.148997
C  1.603278 -0.17912 -1.823924
C  3.942999 -0.173953 -1.160797
C  -2.553744 2.157782 0.297609
C  -4.604439 0.396392 0.894194
C  2.943326 -0.406954 -2.092703
C  -3.358453 -1.526253 -0.088153
C  -3.699694 2.619513 0.929186
C  -4.725373 1.738796 1.224339
H  6.186573 0.628989 -0.046336
H  1.980431 0.92876 1.363451
H  -0.149476 0.878216 0.803245
H  7.634312 1.018765 1.907602
H  6.362063 2.232229 1.823074
H  6.250341 0.909082 2.994439
H  5.590117 -1.786874 0.428722
H  5.825227 -1.478481 2.151378
H  7.184281 -1.362421 1.032157
H  0.866288 -0.380954 -2.582231
H  4.969564 -0.376806 -1.430705
H  -1.757585 2.852062 0.060432
H  -5.409795 -0.278346 1.14917
H  3.220456 -0.786057 -3.067913
H  -3.78594 3.666522 1.186815
H  -5.622385 2.086885 1.718164
elementType: F O N C H
totalener: -1162.35413656 hartree
nucrepener: 1890.94679297 hartree
electener: -3053.30092954 hartree
oneelecener: -5348.54747441 hartree
twoeener: 2295.24654487 hartree
cpcmener: -0.02965025 hartree
kineticenergy: 1157.72969124 hartree
xcener: -106.857783501604 hartree
chargesum: -0.0000000
charge: -0.172624 -0.180108 -0.179057 -0.332133 -0.459806 -0.117810 0.156003 0.038014 0.179590 0.321666 -0.172969 -0.278756 0.404997 -0.256797 -0.261353 -0.257159 -0.239002 -0.202739 -0.055109 -0.176612 0.529303 -0.123838 -0.168632 0.066834 0.118099 0.174948 0.089813 0.096416 0.089631 0.095792 0.090033 0.096005 0.158283 0.141071 0.153889 0.148547 0.156675 0.164035 0.164859
qa: -0.1726 -0.1801 -0.1791 -0.3321 -0.4598 -0.1178 0.1560 0.0380 0.1796 0.3217 -0.1730 -0.2788 0.4050 -0.2568 -0.2614 -0.2572 -0.2390 -0.2027 -0.0551 -0.1766 0.5293 -0.1238 -0.1686 0.0668 0.1181 0.1749 0.0898 0.0964 0.0896 0.0958 0.0900 0.0960 0.1583 0.1411 0.1539 0.1485 0.1567 0.1640 0.1649
va: 1.1218 1.1173 1.1218 2.0826 2.0451 3.2667 3.8232 3.6842 3.8748 3.8673 3.8317 4.0588 3.9797 3.9268 3.8984 3.9600 3.8537 3.9900 3.8565 3.9766 4.4680 3.9173 3.9337 0.9992 1.0298 1.0050 1.0054 1.0083 1.0076 1.0053 1.0080 1.0075 1.0356 1.0066 1.0065 1.0070 0.9937 0.9884 0.9889
dispcorr: -0.016558697 hartree
energy: -1162.370695259479
dipole: 46.33586 -45.34678 0.98909 13.86890 -12.15818 1.71072 9.42312 -7.43384 1.98929
magnitude: 2.80394 au
magnitude: 7.12706 debye
