program: Orca
programVersion: 4.2.1
elementType: F F F O O N C C C C C C C C C C C C C C C C C H H H H H H H H H H H H H H H H
charge: 0
multiplicity: 1
keywords: wb97x-d3
keywords: def2-TZVPP
keywords: def2/J RIJCOSX GRIDX6 NOFINALGRIDX
keywords: grid4 nofinalgrid
keywords: scfconv7
keywords: smallprint printgap noloewdin
keywords: NOSOSCF
formula: C17H16F3NO2
InChI: InChI=1/C17H16F3NO2/c1-11(2)23-13-7-5-6-12(10-13)21-16(22)14-8-3-4-9-15(14)17(18,19)20/h3-11,21H,1-2H3
39 atoms
F  -2.466414 0.168097 -2.559588
F  -1.848356 -1.456614 -1.290286
F  -3.878642 -1.337616 -1.976217
O  4.533038 -0.193249 -0.233038
O  -0.221124 1.050984 -0.688969
N  -0.135982 -0.28637 1.160119
C  4.368512 0.87222 -1.174639
C  -2.220355 0.68401 0.532002
C  1.203603 -0.689118 1.222467
C  3.507958 -0.620956 0.525989
C  -3.211964 0.201777 -0.32503
C  2.19876 -0.159567 0.400273
C  -0.756377 0.497839 0.251692
C  4.349517 2.216813 -0.469906
C  5.52418 0.756596 -2.146268
C  1.516205 -1.66359 2.167211
C  3.822525 -1.599085 1.470055
C  -2.583576 1.421917 1.650678
C  -4.547055 0.466078 -0.052167
C  2.823556 -2.107471 2.278959
C  -2.851759 -0.604283 -1.538252
C  -3.918295 1.695775 1.911294
C  -4.898848 1.21647 1.060062
H  3.436585 0.729436 -1.732099
H  1.942749 0.594143 -0.32448
H  -0.735443 -0.714546 1.850447
H  4.199107 3.015092 -1.197608
H  3.548422 2.294967 0.266025
H  5.29615 2.401486 0.041185
H  6.484279 0.874557 -1.640876
H  5.448221 1.535014 -2.905526
H  5.518911 -0.20632 -2.658081
H  0.744644 -2.074422 2.806743
H  4.841646 -1.952803 1.55864
H  -1.818419 1.801085 2.315942
H  -5.328781 0.090669 -0.697713
H  3.065402 -2.866976 3.010892
H  -4.187103 2.281248 2.780036
H  -5.94238 1.418621 1.258947
elementType: F O N C H
totalener: -1162.35404551 hartree
nucrepener: 1929.83252487 hartree
electener: -3092.18657038 hartree
oneelecener: -5426.37840266 hartree
twoeener: 2334.19183229 hartree
cpcmener: -0.02797911 hartree
kineticenergy: 1157.75051496 hartree
xcener: -106.861786106530 hartree
chargesum: -0.0000000
charge: -0.172284 -0.179416 -0.177996 -0.329080 -0.461632 -0.112039 0.154539 0.032585 0.097480 0.310626 -0.166607 -0.216570 0.403965 -0.263568 -0.257318 -0.256987 -0.287487 -0.208554 -0.053922 -0.092216 0.526700 -0.120911 -0.169565 0.067490 0.136993 0.175997 0.098111 0.096279 0.089606 0.089478 0.089964 0.096774 0.134379 0.138425 0.153324 0.149655 0.155839 0.163667 0.164279
qa: -0.1723 -0.1794 -0.1780 -0.3291 -0.4616 -0.1120 0.1545 0.0326 0.0975 0.3106 -0.1666 -0.2166 0.4040 -0.2636 -0.2573 -0.2570 -0.2875 -0.2086 -0.0539 -0.0922 0.5267 -0.1209 -0.1696 0.0675 0.1370 0.1760 0.0981 0.0963 0.0896 0.0895 0.0900 0.0968 0.1344 0.1384 0.1533 0.1497 0.1558 0.1637 0.1643
va: 1.1229 1.1177 1.1241 2.0952 2.0455 3.2593 3.8243 3.6952 3.9447 3.8271 3.8384 3.8432 3.9676 3.8989 3.9234 3.9464 4.0100 3.9947 3.8567 3.9148 4.4758 3.9125 3.9321 1.0000 1.0487 1.0022 1.0068 1.0049 1.0079 1.0079 1.0053 1.0085 1.0090 1.0130 1.0058 1.0067 0.9885 0.9885 0.9889
dispcorr: -0.017044482 hartree
energy: -1162.371089991182
dipole: 32.90429 -34.22386 -1.31957 11.08906 -10.73660 0.35245 10.25400 -8.13325 2.12075
magnitude: 2.52251 au
magnitude: 6.41172 debye
