program: Orca
programVersion: 4.2.1
elementType: F F F O O N C C C C C C C C C C C C C C C C C H H H H H H H H H H H H H H H H
charge: 0
multiplicity: 1
keywords: wb97x-d3
keywords: def2-TZVPP
keywords: def2/J RIJCOSX GRIDX6 NOFINALGRIDX
keywords: grid4 nofinalgrid
keywords: scfconv7
keywords: smallprint printgap noloewdin
keywords: NOSOSCF
formula: C17H16F3NO2
InChI: InChI=1/C17H16F3NO2/c1-11(2)23-13-7-5-6-12(10-13)21-16(22)14-8-3-4-9-15(14)17(18,19)20/h3-11,21H,1-2H3
39 atoms
F  -2.31582 0.574421 -2.534415
F  -1.701625 -1.218924 -1.506097
F  -3.703369 -1.039592 -2.264448
O  4.561755 0.014168 0.051781
O  -0.192231 1.170785 -0.444683
N  -0.134306 -0.340799 1.271872
C  4.337374 0.921533 -1.022542
C  -2.231613 0.587372 0.617793
C  1.222743 -0.669244 1.393239
C  3.5376 -0.482997 0.764829
C  -3.157932 0.229225 -0.362947
C  2.210813 -0.095695 0.59537
C  -0.744387 0.504423 0.398082
C  5.671598 1.589695 -1.29252
C  3.808107 0.200601 -2.25266
C  1.558019 -1.615519 2.356957
C  3.876011 -1.431694 1.730047
C  -2.68422 1.113437 1.821628
C  -4.513317 0.408364 -0.124464
C  2.883798 -1.984235 2.51476
C  -2.712567 -0.359915 -1.674313
C  -4.038567 1.299533 2.050935
C  -4.953378 0.946838 1.074848
H  3.621973 1.692172 -0.710779
H  1.92975 0.635502 -0.142867
H  -0.750583 -0.868644 1.868261
H  5.567707 2.321577 -2.093244
H  6.041188 2.107935 -0.408219
H  6.420475 0.858646 -1.59978
H  2.86659 -0.313778 -2.063384
H  4.531379 -0.53509 -2.607008
H  3.6322 0.915784 -3.05666
H  0.792444 -2.065268 2.978037
H  4.910962 -1.721013 1.851436
H  -1.966709 1.402912 2.579369
H  -5.240276 0.123235 -0.871553
H  3.144604 -2.719808 3.264117
H  -4.374424 1.721087 2.988734
H  -6.012671 1.084451 1.243198
totalener: -1162.33272004 hartree
nucrepener: 1933.97554726 hartree
electener: -3096.30826730 hartree
oneelecener: -5433.75767094 hartree
twoeener: 2337.44940364 hartree
kineticenergy: 1157.76531048 hartree
xcener: -106.860375616016 hartree
chargesum: 0.0000000
charge: -0.151796 -0.170670 -0.176024 -0.289888 -0.372135 -0.149093 0.125438 0.026458 0.123038 0.293618 -0.177599 -0.208501 0.387052 -0.239367 -0.247882 -0.227398 -0.248550 -0.215812 -0.040780 -0.067377 0.523351 -0.104635 -0.141733 0.058512 0.147976 0.143449 0.079302 0.092731 0.084732 0.101794 0.084068 0.085775 0.091160 0.116059 0.140394 0.134305 0.120039 0.135172 0.134817
qa: -0.1518 -0.1707 -0.1760 -0.2899 -0.3721 -0.1491 0.1254 0.0265 0.1230 0.2936 -0.1776 -0.2085 0.3871 -0.2394 -0.2479 -0.2274 -0.2485 -0.2158 -0.0408 -0.0674 0.5234 -0.1046 -0.1417 0.0585 0.1480 0.1434 0.0793 0.0927 0.0847 0.1018 0.0841 0.0858 0.0912 0.1161 0.1404 0.1343 0.1200 0.1352 0.1348
va: 1.1541 1.1317 1.1248 2.1326 2.1331 3.2537 3.8777 3.7021 3.9638 3.8975 3.9187 3.8732 3.9908 3.9253 3.9011 4.0068 4.0568 4.0227 3.8874 3.9930 4.4793 3.9716 3.9754 1.0005 1.0402 1.0261 1.0069 1.0111 1.0104 1.0095 1.0080 1.0103 1.0183 1.0185 1.0117 1.0137 0.9992 0.9989 0.9996
dispcorr: -0.017065445 hartree
energy: -1162.349785483816
dipole: 30.94832 -31.89765 -0.94934 5.89775 -5.88039 0.01737 8.93352 -7.67452 1.25900
magnitude: 1.57691 au
magnitude: 4.00818 debye
