program: Orca
programVersion: 4.2.1
elementType: F F F O O N C C C C C C C C C C C C C C C C C H H H H H H H H H H H H H H H H
charge: 0
multiplicity: 1
keywords: wb97x-d3
keywords: def2-TZVPP
keywords: def2/J RIJCOSX GRIDX6 NOFINALGRIDX
keywords: grid4 nofinalgrid
keywords: scfconv7
keywords: smallprint printgap noloewdin
keywords: NOSOSCF
formula: C17H16F3NO2
InChI: InChI=1/C17H16F3NO2/c1-11(2)23-13-7-5-6-12(10-13)21-16(22)14-8-3-4-9-15(14)17(18,19)20/h3-11,21H,1-2H3
39 atoms
F  -1.7715 -0.898153 -1.751312
F  -2.475079 -2.143177 -0.137822
F  -3.82262 -1.530538 -1.692239
O  4.564838 -0.015314 -0.296772
O  -0.055894 1.672143 -0.386405
N  -0.184208 -0.314924 0.732944
C  4.485134 1.285172 -0.86904
C  -2.182582 0.969663 0.363116
C  1.134275 -0.790478 0.730782
C  3.479231 -0.614749 0.221559
C  -3.162087 0.109645 -0.13926
C  2.195123 -0.078088 0.174321
C  -0.696503 0.807574 0.166436
C  4.412688 2.355718 0.209125
C  5.720198 1.440577 -1.735341
C  1.355282 -2.02689 1.330008
C  3.702792 -1.8538 0.821615
C  -2.575892 2.109942 1.055198
C  -4.505428 0.385122 0.091213
C  2.639109 -2.54472 1.36661
C  -2.804589 -1.113033 -0.938268
C  -3.913587 2.37348 1.291258
C  -4.88072 1.505603 0.811904
H  3.60116 1.351644 -1.514778
H  2.002029 0.875675 -0.285211
H  -0.83852 -0.909263 1.214559
H  5.304819 2.329273 0.836326
H  4.35079 3.3435 -0.24842
H  3.541745 2.238482 0.853264
H  6.629833 1.375146 -1.137043
H  5.710951 2.412282 -2.228714
H  5.760615 0.671781 -2.506302
H  0.532208 -2.586219 1.758213
H  4.705266 -2.258706 0.848186
H  -1.818603 2.795177 1.411835
H  -5.271253 -0.267882 -0.302386
H  2.809918 -3.50774 1.829155
H  -4.199229 3.259964 1.841218
H  -5.929422 1.705206 0.984479
totalener: -1162.33388181 hartree
nucrepener: 1940.86109087 hartree
electener: -3103.19497268 hartree
oneelecener: -5447.28337939 hartree
twoeener: 2344.08840671 hartree
kineticenergy: 1157.75696424 hartree
xcener: -106.859642082039 hartree
chargesum: -0.0000000
charge: -0.157409 -0.180262 -0.168085 -0.290274 -0.387016 -0.146654 0.128338 0.074550 0.128330 0.295727 -0.226481 -0.210956 0.376866 -0.248973 -0.239745 -0.229123 -0.249940 -0.184625 -0.050001 -0.064236 0.536730 -0.103559 -0.137062 0.060227 0.144055 0.145095 0.084707 0.084884 0.096157 0.084761 0.077976 0.094093 0.093790 0.115306 0.129848 0.132122 0.120203 0.135599 0.135038
qa: -0.1574 -0.1803 -0.1681 -0.2903 -0.3870 -0.1467 0.1283 0.0745 0.1283 0.2957 -0.2265 -0.2110 0.3769 -0.2490 -0.2397 -0.2291 -0.2499 -0.1846 -0.0500 -0.0642 0.5367 -0.1036 -0.1371 0.0602 0.1441 0.1451 0.0847 0.0849 0.0962 0.0848 0.0780 0.0941 0.0938 0.1153 0.1298 0.1321 0.1202 0.1356 0.1350
va: 1.1498 1.1072 1.1387 2.1308 2.1257 3.2490 3.8725 3.6988 3.9604 3.8927 3.9277 3.8852 4.0553 3.8998 3.9265 4.0146 4.0545 4.0412 3.9095 3.9845 4.4578 3.9480 3.9728 1.0011 1.0427 1.0332 1.0087 1.0103 1.0101 1.0100 1.0072 1.0110 1.0198 1.0188 1.0180 1.0143 0.9992 0.9984 0.9998
dispcorr: -0.017483805 hartree
energy: -1162.351365612411
dipole: 32.91424 -33.87753 -0.96328 16.29143 -15.85772 0.43370 6.68123 -5.77976 0.90147
magnitude: 1.38876 au
magnitude: 3.52995 debye
