program: Orca
programVersion: 4.2.1
elementType: F F F O O N C C C C C C C C C C C C C C C C C H H H H H H H H H H H H H H H H
charge: 0
multiplicity: 1
keywords: wb97x-d3
keywords: def2-TZVPP
keywords: def2/J RIJCOSX GRIDX6 NOFINALGRIDX
keywords: grid4 nofinalgrid
keywords: scfconv7
keywords: smallprint printgap noloewdin
keywords: NOSOSCF
formula: C17H16F3NO2
InChI: InChI=1/C17H16F3NO2/c1-11(2)23-13-7-5-6-12(10-13)21-16(22)14-8-3-4-9-15(14)17(18,19)20/h3-11,21H,1-2H3
39 atoms
F  -3.701512 -1.780964 -1.342677
F  -2.125998 -2.000287 0.11316
F  -4.177482 -2.265963 0.69266
O  4.452101 0.609877 1.086597
O  -1.307669 0.012695 -1.99871
N  -0.060207 0.540082 -0.155133
C  5.838245 0.325169 0.951828
C  -2.429084 0.811677 -0.067316
C  1.257507 0.289419 -0.557048
C  3.590946 0.315957 0.094596
C  -3.460406 -0.070784 0.256961
C  2.248097 0.531433 0.387712
C  -1.217163 0.390653 -0.856495
C  6.548798 1.170587 1.991091
C  6.112936 -1.158391 1.143963
C  1.605708 -0.178393 -1.824644
C  3.945178 -0.155489 -1.166726
C  -2.549082 2.153159 0.274309
C  -4.590991 0.403641 0.907489
C  2.944667 -0.389897 -2.098264
C  -3.364351 -1.534396 -0.079528
C  -3.684118 2.623779 0.915756
C  -4.706753 1.746651 1.230878
H  6.185773 0.63969 -0.040072
H  1.992389 0.898017 1.37571
H  -0.166658 0.80794 0.809883
H  7.625699 1.016096 1.926897
H  6.351135 2.231192 1.838958
H  6.23012 0.90312 2.999252
H  5.578066 -1.776631 0.423159
H  5.815786 -1.476247 2.144196
H  7.177992 -1.362387 1.028943
H  0.85811 -0.377043 -2.573093
H  4.973283 -0.342741 -1.440549
H  -1.754846 2.841903 0.014488
H  -5.390723 -0.272986 1.173172
H  3.221857 -0.756319 -3.077985
H  -3.76748 3.673069 1.164776
H  -5.596185 2.101986 1.732912
totalener: -1162.33143126 hartree
nucrepener: 1891.13332808 hartree
electener: -3053.46475934 hartree
oneelecener: -5348.01928749 hartree
twoeener: 2294.55452815 hartree
kineticenergy: 1157.76451437 hartree
xcener: -106.859201462228 hartree
chargesum: 0.0000000
charge: -0.151425 -0.170053 -0.176591 -0.296364 -0.359332 -0.151929 0.125303 0.027519 0.192842 0.292954 -0.171003 -0.253682 0.370390 -0.238423 -0.247271 -0.204158 -0.211624 -0.206237 -0.046654 -0.136438 0.524267 -0.104928 -0.142470 0.052750 0.086920 0.143362 0.078439 0.093905 0.086039 0.094818 0.087225 0.084785 0.151792 0.109512 0.138291 0.133661 0.123750 0.135058 0.135000
qa: -0.1514 -0.1701 -0.1766 -0.2964 -0.3593 -0.1519 0.1253 0.0275 0.1928 0.2930 -0.1710 -0.2537 0.3704 -0.2384 -0.2473 -0.2042 -0.2116 -0.2062 -0.0467 -0.1364 0.5243 -0.1049 -0.1425 0.0528 0.0869 0.1434 0.0784 0.0939 0.0860 0.0948 0.0872 0.0848 0.1518 0.1095 0.1383 0.1337 0.1237 0.1351 0.1350
va: 1.1545 1.1321 1.1238 2.1144 2.1425 3.2453 3.8795 3.7080 3.8984 3.9862 3.9091 4.0865 4.0068 3.9344 3.8965 4.0228 3.8879 4.0196 3.8940 4.0056 4.4781 3.9709 3.9764 0.9992 1.0353 1.0276 1.0072 1.0108 1.0104 1.0092 1.0099 1.0098 1.0367 1.0139 1.0116 1.0137 1.0028 0.9987 0.9997
dispcorr: -0.016588295 hartree
energy: -1162.348019555250
dipole: 46.36249 -45.67247 0.69002 13.86706 -12.69303 1.17403 9.37045 -8.01305 1.35740
magnitude: 1.92276 au
magnitude: 4.88726 debye
