program: Orca
programVersion: 4.2.1
elementType: F F F O O N C C C C C C C C C C C C C C C C C H H H H H H H H H H H H H H H H
charge: 0
multiplicity: 1
keywords: wb97x-d3
keywords: def2-TZVPP
keywords: def2/J RIJCOSX GRIDX6 NOFINALGRIDX
keywords: grid4 nofinalgrid
keywords: scfconv7
keywords: smallprint printgap noloewdin
keywords: NOSOSCF
formula: C17H16F3NO2
InChI: InChI=1/C17H16F3NO2/c1-11(2)23-13-7-5-6-12(10-13)21-16(22)14-8-3-4-9-15(14)17(18,19)20/h3-11,21H,1-2H3
39 atoms
F  -3.026213 -0.663148 -2.537241
F  -1.171537 0.268101 -1.988607
F  -1.788078 -1.562549 -1.031661
O  4.534704 0.061437 -0.235131
O  -1.467672 -1.162992 2.28773
N  -0.126285 0.0386 0.882989
C  4.362949 1.026527 -1.263213
C  -2.497075 0.432251 0.881791
C  1.150214 -0.495516 1.102366
C  3.481808 -0.409576 0.457852
C  -2.941754 0.406502 -0.442296
C  2.177783 0.047716 0.324933
C  -1.31746 -0.341184 1.41531
C  5.727731 1.645017 -1.497093
C  3.807442 0.390744 -2.529044
C  1.423635 -1.500814 2.020704
C  3.759408 -1.422065 1.376971
C  -3.213565 1.166403 1.82053
C  -4.067768 1.136789 -0.806149
C  2.734871 -1.945539 2.137217
C  -2.234075 -0.397409 -1.497541
C  -4.325647 1.902024 1.450447
C  -4.75201 1.889124 0.132627
H  3.684549 1.817523 -0.917852
H  1.932567 0.825265 -0.387662
H  -0.15955 0.787346 0.211221
H  5.66375 2.415392 -2.265311
H  6.113109 2.105736 -0.588144
H  6.445058 0.89468 -1.83148
H  4.499621 -0.358011 -2.916119
H  3.666138 1.148515 -3.300512
H  2.846836 -0.097165 -2.365143
H  0.64616 -1.93114 2.62792
H  4.774489 -1.780409 1.481442
H  -2.889583 1.157691 2.852675
H  -4.427637 1.112913 -1.824873
H  2.955514 -2.729891 2.8493
H  -4.863585 2.475872 2.192898
H  -5.625489 2.452559 -0.165629
totalener: -1162.33214405 hartree
nucrepener: 1942.94570919 hartree
electener: -3105.27785324 hartree
oneelecener: -5451.24377594 hartree
twoeener: 2345.96592270 hartree
kineticenergy: 1157.75776962 hartree
xcener: -106.858695447561 hartree
chargesum: -0.0000000
charge: -0.168040 -0.183694 -0.156534 -0.290710 -0.372876 -0.154244 0.126345 0.053631 0.136328 0.291253 -0.214200 -0.200634 0.376804 -0.239584 -0.250084 -0.219767 -0.239458 -0.173051 -0.058228 -0.072115 0.535759 -0.109959 -0.132795 0.049671 0.074004 0.142561 0.077515 0.094760 0.087454 0.089430 0.084678 0.095856 0.147570 0.116132 0.131172 0.132395 0.121856 0.135193 0.135611
qa: -0.1680 -0.1837 -0.1565 -0.2907 -0.3729 -0.1542 0.1263 0.0536 0.1363 0.2913 -0.2142 -0.2006 0.3768 -0.2396 -0.2501 -0.2198 -0.2395 -0.1731 -0.0582 -0.0721 0.5358 -0.1100 -0.1328 0.0497 0.0740 0.1426 0.0775 0.0948 0.0875 0.0894 0.0847 0.0959 0.1476 0.1161 0.1312 0.1324 0.1219 0.1352 0.1356
va: 1.1389 1.1024 1.1510 2.1300 2.1368 3.2421 3.8763 3.7236 3.9602 3.9391 3.9129 3.8692 4.0664 3.9339 3.8962 4.0316 4.0413 4.0295 3.9210 3.9423 4.4562 3.9514 3.9695 0.9993 1.0315 1.0360 1.0066 1.0110 1.0105 1.0096 1.0093 1.0089 1.0383 1.0178 1.0167 1.0141 0.9998 0.9986 0.9994
dispcorr: -0.017393009 hartree
energy: -1162.349537056097
dipole: 29.35161 -29.68888 -0.33727 11.51427 -9.76414 1.75013 1.24537 -1.91566 -0.67030
magnitude: 1.90421 au
magnitude: 4.84012 debye
