program: Orca
programVersion: 4.2.1
elementType: Cl F F F F F F O N N C C C C C C C C C C C C C C C C H H H H H H H H H H H
charge: 0
multiplicity: 1
keywords: wb97x-d3
keywords: def2-TZVPP
keywords: def2/J RIJCOSX GRIDX6 NOFINALGRIDX
keywords: grid4 nofinalgrid
keywords: scfconv7
keywords: smallprint printgap noloewdin
keywords: NOSOSCF
formula: C16H11ClF6N2O
InChI: InChI=1/C16H11ClF6N2O/c17-12-7-9(15(18,19)20)8-25-13(12)5-6-24-14(26)10-3-1-2-4-11(10)16(21,22)23/h1-4,7-8,24H,5-6H2
37 atoms
Cl -3.582353 -3.004499 -1.296498
F  3.849653 -0.653979 1.385738
F  4.426547 1.330608 1.962579
F  2.350312 0.859161 1.702713
F  -5.409942 1.588272 0.446932
F  -4.554129 1.368978 2.406407
F  -3.684862 2.74838 1.008134
O  3.254022 -2.17173 -1.407762
N  1.449327 -1.206091 -0.426684
N  -1.15763 -0.424243 0.43729
C  -0.632526 -2.551673 -0.615547
C  0.755995 -2.407207 -0.015242
C  -1.614066 -1.499281 -0.195058
C  3.206484 0.191224 -1.259041
C  2.643757 -1.182108 -1.01837
C  3.664031 1.037767 -0.246132
C  -2.980748 -1.624084 -0.45673
C  -3.355353 0.4617 0.608843
C  -3.865115 -0.646572 -0.049542
C  3.327472 0.593227 -2.584087
C  4.207261 2.275849 -0.570072
C  -1.989917 0.52834 0.827032
C  3.575592 0.642908 1.19813
C  3.860075 1.832346 -2.902309
C  4.299892 2.674478 -1.893621
C  -4.253325 1.543754 1.113447
H  -0.571063 -2.569828 -1.707751
H  -1.014623 -3.533092 -0.325556
H  0.692805 -2.42878 1.07418
H  1.349318 -3.267828 -0.313428
H  1.011129 -0.339776 -0.152557
H  -4.922836 -0.755851 -0.247152
H  2.989055 -0.063465 -3.37475
H  4.570593 2.939128 0.202261
H  -1.53868 1.374025 1.330851
H  3.936047 2.135189 -3.937656
H  4.723366 3.640223 -2.13198
elementType: Cl F O N C H
totalener: -1860.56334996 hartree
nucrepener: 2529.72810914 hartree
electener: -4390.29145909 hartree
oneelecener: -7592.43230661 hartree
twoeener: 3202.14084752 hartree
cpcmener: -0.03202845 hartree
kineticenergy: 1854.81935969 hartree
xcener: -144.354198055635 hartree
chargesum: -0.0000000
charge: -0.070095 -0.178868 -0.176016 -0.180146 -0.177403 -0.176500 -0.178115 -0.549161 -0.186116 -0.382284 -0.114089 -0.054425 0.283667 0.037207 0.397301 -0.155509 -0.037611 -0.071050 -0.071281 -0.194506 -0.077393 0.001073 0.537810 -0.138860 -0.162041 0.553903 0.106626 0.097150 0.116923 0.100651 0.196411 0.137303 0.148824 0.149942 0.131881 0.166815 0.167983
qa: -0.0701 -0.1789 -0.1760 -0.1801 -0.1774 -0.1765 -0.1781 -0.5492 -0.1861 -0.3823 -0.1141 -0.0544 0.2837 0.0372 0.3973 -0.1555 -0.0376 -0.0711 -0.0713 -0.1945 -0.0774 0.0011 0.5378 -0.1389 -0.1620 0.5539 0.1066 0.0971 0.1169 0.1007 0.1964 0.1373 0.1488 0.1499 0.1319 0.1668 0.1680
va: 1.2509 1.1203 1.1279 1.1069 1.1271 1.1138 1.1245 1.9561 3.1648 3.0007 3.9280 3.8610 3.6423 3.6618 4.1144 3.8303 4.1061 3.7338 4.0619 3.9965 3.8840 4.1191 4.4453 3.9085 3.9162 4.4185 1.0112 1.0129 1.0063 1.0360 1.0198 1.0213 1.0067 1.0070 1.0127 0.9866 0.9875
dispcorr: -0.018058691 hartree
energy: -1860.581408649482
dipole: 18.07359 -19.55575 -1.48216 -5.35012 6.55449 1.20438 -15.48190 14.77082 -0.71109
magnitude: 2.03788 au
magnitude: 5.17988 debye
