program: Gaussian 09
title: 000069402
version: EM64L-G09RevD.01
frameworkgroup: C1[X(C6H6)]
method: RPBEPBE
basis: SDD
operation: Freq
keyword: #p
keyword: freq=noraman
keyword: PBEPBE/SDD
title: #p freq=noraman PBEPBE/SDD
converged: YES YES NO NO
title: Mulliken charges:
elementType: C C C C C C H H H H H H
charge: -0.485503 -0.485190 0.211286 0.211117 -0.494989 -0.494786 0.246520 0.246485 0.246468 0.246484 0.276110 0.275998
chargesum: 0.00000
title: Mulliken charges with hydrogens summed into heavy atoms:
elementType: C C C C C C
charge: 0.007502 0.007762 0.211286 0.211117 -0.218879 -0.218788
polarizability: 1.00092811e+02 -1.23613468e+01 4.03561918e+01 -9.39523647e-03 3.22961750e-03 3.37273220e+01
1716.lowfreq: -5.6925 -0.0006 -0.0005 -0.0004 5.1774 30.6970 74.5321 115.7553 201.9001
frequency: 74.5320 115.7553 201.8992 309.9476 351.3666 472.1956 473.3912 637.6351 638.5914 647.7391 649.4968 761.0970 939.8626 949.5310 1010.2062 1023.5091 1172.0262 1266.8224 1276.6867 1333.5071 1460.2907 1466.1248 2140.9910 2144.1464 2993.7991 3002.7284 3040.2542 3064.5644 3425.5740 3426.0858
redmass: 3.3606 3.7458 4.5382 3.1187 2.9628 7.9047 5.2356 1.2308 1.2286 1.2398 1.2234 1.2228 4.6978 4.9216 1.7905 3.3507 1.1213 1.2893 1.0891 1.3766 1.0833 1.0904 6.0146 6.0567 1.0593 1.0584 1.1008 1.1031 1.1589 1.1591
irintensity: 0.1554 0.1231 0.0000 0.0000 15.5817 0.0022 19.2901 0.3187 155.6592 0.0121 151.0954 3.8936 5.7874 0.0000 0.0000 0.0000 0.1709 4.5456 0.0000 0.0000 0.0000 17.9368 0.0002 14.0204 0.0000 29.1087 0.0000 21.4449 133.7210 0.6654
temp: 298.150 k
press: 1.00000 atm
elementType: 6 6 6 6 6 6 1 1 1 1 1 1
symmnumber: 1
zpe: 242066.5 jmol-1
zpe.correction: 0.092198 hartree
zpe.thermalcorrener: 0.099203 hartree
zpe.thermalcorrenthalpy: 0.100147 hartree
zpe.thermalcorrgfe: 0.061697 hartree
zpe.sumelectzpe: -231.666704 hartree
zpe.sumelectthermal: -231.659699 hartree
zpe.sumelectthermalent: -231.658755 hartree
zpe.sumelectthermalfe: -231.697205 hartree
dipole: -0.0032 -0.0100 0.0010
dipole: 0.0106
quadrupole: -31.0396 -35.8151 -36.9456
quadrupole: -2.9860 0.0201 -0.0020
quadrupole: 3.5605 -1.2150 -2.3455 -2.9860 0.0201 -0.0020
hfenergy: -231.758902 hartree
pointgroup: C01 [X(C6H6)]
dipole: 0.0013338 0.0039237 0.0004035 debye
dipolederiv: 0.1202124 -0.0037209 0.0000032 0.0705251 0.1054383 0.000111 -0.0000884 0.0000711 0.1672949 0.120481 -0.0037991 0.000006 0.0712039 0.1056999 0.0000951 -0.0001088 0.0000547 0.1670298 0.2030241 -0.1019448 0.0003191 -0.2104006 -0.0792827 -0.0001925 0.0005286 -0.0002062 -0.0663959 0.2019007 -0.1025338 0.0002075 -0.212041 -0.0789815 -0.0001365 0.0003779 -0.0001495 -0.0661691 -0.5774013 0.0075411 -0.0004464 0.0870223 -0.3385594 0.0001798 -0.0010478 0.0003241 -0.3421256 -0.5755396 0.0086519 -0.0003127 0.0906307 -0.3395752 0.000122 -0.0006819 0.0002136 -0.3422348 0.0181798 0.0393666 0.0360377 0.0154418 0.0270255 -0.0865694 0.0266474 -0.1075359 -0.0129882 0.018191 0.0393301 -0.0360685 0.0153312 0.0270597 0.086526 -0.0265892 0.1075313 -0.0130541 0.0181817 0.039335 -0.0361376 0.0153641 0.0269955 0.0865691 -0.0265417 0.1074642 -0.0130105 0.0181833 0.0393568 0.0361305 0.0154311 0.0269761 -0.0866007 0.0265859 -0.1074715 -0.0129976 0.2177354 0.0194494 0.0001567 0.0218267 0.2582886 -0.0000639 0.0005578 -0.0001806 0.2672983 0.2168515 0.0189677 0.0001046 0.0196647 0.2589151 -0.00004 0.0003603 -0.0001153 0.2673529 unknown
polarizability: 99.7266192|-13.2114959|40.7223802|0.0178949|-0.0042855|33.7273252 unknown
InChI: InChI=1S/C6H6/c1-3-5-6-4-2/h1-2H,5-6H2
charge 0 multiplicity 1
12 atoms
C  -0.494533 -0.607271 -0.000708
C  0.494054 0.605806 -0.000511
C  -1.902598 -0.174991 -0.001183
C  1.902112 0.173498 -0.000163
C  -3.078015 0.199089 -0.001486
C  3.077689 -0.200079 -0.000036
H  -0.292896 -1.23566 -0.88834
H  -0.29345 -1.235495 0.887165
H  0.292889 1.234097 -0.888321
H  0.292493 1.234131 0.887182
H  -4.102866 0.522492 0.000403
H  4.10502 -0.515517 -0.0013
