program: Orca
programVersion: 4.2.1
elementType: Cl F F F F F F O N N C C C C C C C C C C C C C C C C H H H H H H H H H H H
charge: 0
multiplicity: 1
keywords: wb97x-d3
keywords: def2-TZVPP
keywords: def2/J RIJCOSX GRIDX6 NOFINALGRIDX
keywords: grid4 nofinalgrid
keywords: scfconv7
keywords: smallprint printgap noloewdin
keywords: NOSOSCF
formula: C16H11ClF6N2O
InChI: InChI=1/C16H11ClF6N2O/c17-12-7-9(15(18,19)20)8-25-13(12)5-6-24-14(26)10-3-1-2-4-11(10)16(21,22)23/h1-4,7-8,24H,5-6H2
37 atoms
Cl -0.701145 -0.160435 2.30882
F  5.772883 -0.18433 -1.189875
F  5.018781 -1.033807 0.62601
F  4.131338 -1.560464 -1.267384
F  -6.005295 0.893534 -0.828502
F  -5.298752 1.994732 0.8810
F  -4.449556 2.360107 -1.057492
O  2.181979 -1.706169 0.886635
N  0.755036 -1.336537 -0.823604
N  -2.928155 -1.760808 -0.543278
C  -0.934711 -2.665513 0.450193
C  0.055916 -2.598733 -0.714243
C  -1.963735 -1.583978 0.355486
C  2.317663 0.383694 -0.238174
C  1.753102 -0.986879 -0.004235
C  3.68508 0.600391 -0.440421
C  -1.928983 -0.417153 1.121109
C  -3.877169 0.348832 0.00148
C  -2.887298 0.56258 0.945953
C  1.461936 1.476908 -0.180388
C  4.169368 1.895728 -0.560485
C  -3.85453 -0.83415 -0.720056
C  4.647574 -0.545749 -0.562533
C  1.95162 2.770088 -0.292628
C  3.306918 2.979172 -0.476242
C  -4.912337 1.396258 -0.25033
H  -1.43718 -3.632154 0.397401
H  -0.400716 -2.632431 1.397098
H  0.775998 -3.410908 -0.613455
H  -0.468901 -2.754093 -1.654343
H  0.462808 -0.693017 -1.541452
H  -2.853941 1.466524 1.539737
H  0.40101 1.326383 -0.031269
H  5.221245 2.079056 -0.727633
H  -4.606117 -1.053594 -1.467534
H  1.271213 3.608408 -0.234378
H  3.700065 3.98227 -0.565454
elementType: Cl F O N C H
totalener: -1860.56415747 hartree
nucrepener: 2588.15616350 hartree
electener: -4448.72032097 hartree
oneelecener: -7709.61126492 hartree
twoeener: 3260.89094394 hartree
cpcmener: -0.03679761 hartree
kineticenergy: 1854.82073054 hartree
xcener: -144.353335108556 hartree
chargesum: 0.0000000
charge: -0.071477 -0.181172 -0.174925 -0.181552 -0.177371 -0.178442 -0.176949 -0.509781 -0.157104 -0.360620 -0.109476 -0.067220 0.226588 0.108481 0.301534 -0.158294 -0.036099 -0.059089 -0.072350 -0.213298 -0.061444 0.006983 0.529184 -0.148202 -0.163234 0.552355 0.102831 0.095562 0.108143 0.120439 0.188847 0.138269 0.163042 0.148611 0.136446 0.163838 0.166946
qa: -0.0715 -0.1812 -0.1749 -0.1816 -0.1774 -0.1784 -0.1769 -0.5098 -0.1571 -0.3606 -0.1095 -0.0672 0.2266 0.1085 0.3015 -0.1583 -0.0361 -0.0591 -0.0723 -0.2133 -0.0614 0.0070 0.5292 -0.1482 -0.1632 0.5524 0.1028 0.0956 0.1081 0.1204 0.1888 0.1383 0.1630 0.1486 0.1364 0.1638 0.1669
va: 1.2444 1.1179 1.1172 1.1167 1.1282 1.1237 1.1141 1.9849 3.1738 3.0617 3.8191 3.8821 3.6984 3.5693 4.1292 3.8098 4.0250 3.6996 4.0622 3.9934 3.8552 4.1001 4.4717 3.9816 3.9234 4.4228 1.0297 1.0422 1.0152 1.0134 0.9968 1.0218 0.9951 1.0068 1.0127 0.9900 0.9873
dispcorr: -0.020230589 hartree
energy: -1860.584388058234
dipole: 3.65284 -5.11618 -1.46334 -3.74228 5.45758 1.71530 -3.75617 2.46879 -1.28738
magnitude: 2.59633 au
magnitude: 6.59935 debye
