program: Orca
programVersion: 4.2.1
elementType: Cl F F F F F F O N N C C C C C C C C C C C C C C C C H H H H H H H H H H H
charge: 0
multiplicity: 1
keywords: wb97x-d3
keywords: def2-TZVPP
keywords: def2/J RIJCOSX GRIDX6 NOFINALGRIDX
keywords: grid4 nofinalgrid
keywords: scfconv7
keywords: smallprint printgap noloewdin
keywords: NOSOSCF
formula: C16H11ClF6N2O
InChI: InChI=1/C16H11ClF6N2O/c17-12-7-9(15(18,19)20)8-25-13(12)5-6-24-14(26)10-3-1-2-4-11(10)16(21,22)23/h1-4,7-8,24H,5-6H2
37 atoms
Cl -3.158904 -2.684368 1.980023
F  4.486128 -1.065333 -1.360297
F  6.072788 0.344754 -1.055685
F  5.431483 -0.896857 0.569565
F  -5.712397 1.650868 0.584921
F  -4.192446 2.885618 -0.309025
F  -5.379177 1.587136 -1.539714
O  2.577614 -1.762664 0.757111
N  1.11095 -1.035128 -0.805762
N  -1.689555 -0.369201 -0.851732
C  -0.756058 -2.399555 0.10986
C  0.348512 -2.255663 -0.926566
C  -1.830135 -1.356456 0.024926
C  2.647534 0.532058 0.122112
C  2.122735 -0.873954 0.053236
C  3.991692 0.854671 -0.084253
C  -2.963239 -1.404637 0.840451
C  -3.757422 0.586952 -0.173298
C  -3.940598 -0.434028 0.744596
C  1.754112 1.540154 0.46534
C  4.415654 2.169285 0.060667
C  -2.611211 0.573216 -0.953118
C  4.991706 -0.193687 -0.478946
C  2.18349 2.849716 0.618966
C  3.516247 3.163397 0.417116
C  -4.764624 1.676887 -0.353552
H  -1.206067 -3.389688 -0.006372
H  -0.325226 -2.393151 1.115684
H  1.021491 -3.10775 -0.837117
H  -0.067614 -2.28683 -1.93253
H  0.768637 -0.235482 -1.313727
H  -4.815663 -0.483124 1.378206
H  0.711446 1.300053 0.632833
H  5.449283 2.438692 -0.106295
H  -2.421549 1.345617 -1.68987
H  1.475125 3.619372 0.894876
H  3.862647 4.181741 0.529506
elementType: Cl F O N C H
totalener: -1860.57402892 hartree
nucrepener: 2511.70164336 hartree
electener: -4372.27567229 hartree
oneelecener: -7556.56624462 hartree
twoeener: 3184.29057233 hartree
cpcmener: -0.02843937 hartree
kineticenergy: 1854.81504191 hartree
xcener: -144.351682256734 hartree
chargesum: 0.0000000
charge: -0.068973 -0.180486 -0.181343 -0.172953 -0.176254 -0.178550 -0.177127 -0.499396 -0.180706 -0.361537 -0.106618 -0.068234 0.247958 0.044499 0.367346 -0.152511 -0.024636 -0.056399 -0.086906 -0.206392 -0.062984 -0.023131 0.530332 -0.134013 -0.167184 0.556160 0.109128 0.101847 0.107223 0.119535 0.182027 0.135987 0.157873 0.147256 0.132918 0.162742 0.163505
qa: -0.0690 -0.1805 -0.1813 -0.1730 -0.1763 -0.1785 -0.1771 -0.4994 -0.1807 -0.3615 -0.1066 -0.0682 0.2480 0.0445 0.3673 -0.1525 -0.0246 -0.0564 -0.0869 -0.2064 -0.0630 -0.0231 0.5303 -0.1340 -0.1672 0.5562 0.1091 0.1018 0.1072 0.1195 0.1820 0.1360 0.1579 0.1473 0.1329 0.1627 0.1635
va: 1.2538 1.1183 1.1178 1.1209 1.1303 1.1210 1.1173 2.0119 3.1719 2.9762 3.8426 3.8846 3.6657 3.6393 4.1258 3.8195 4.0818 3.7088 4.0648 3.9826 3.8631 4.1345 4.4722 3.9409 3.9304 4.4187 1.0118 1.0168 1.0218 1.0116 1.0177 1.0214 1.0017 1.0072 1.0124 0.9894 0.9889
dispcorr: -0.018324667 hartree
energy: -1860.592353589951
dipole: 7.76903 -9.71956 -1.95052 0.28793 1.22382 1.51175 -1.06529 0.43813 -0.62715
magnitude: 2.54623 au
magnitude: 6.47199 debye
