program: Gaussian 09
title: 000007651
version: EM64L-G09RevD.01
frameworkgroup: C1[X(C12H16O2)]
method: RPBEPBE
basis: SDD
operation: Freq
keyword: #pfreq=noraman
keyword: PBEPBE/SDD
title: #p freq=noraman PBEPBE/SDD
converged: YES YES NO NO
title: Mulliken charges:
elementType: O O C C C C C C C C C C C C H H H H H H H H H H H H H H H H
charge: -0.263844 -0.249478 -0.052680 -0.502459 -0.694067 -0.695422 0.265868 -0.437279 0.478815 -0.385618 -0.384164 -0.224444 -0.224568 -0.231948 0.209113 0.238794 0.222767 0.249092 0.204339 0.207816 0.217247 0.221897 0.212536 0.233380 0.230124 0.233930 0.233148 0.228368 0.228169 0.230567
chargesum: 0.00000
title: Mulliken charges with hydrogens summed into heavy atoms:
elementType: O O C C C C C C C C C C C C
charge: -0.263844 -0.249478 0.156434 -0.040898 -0.032821 -0.043741 0.265868 0.026225 0.478815 -0.151688 -0.151016 0.003924 0.003601 -0.001381
polarizability: 1.78020300e+02 -1.10073366e+01 1.24554506e+02 -1.42997622e+01 -9.05139374e+00 9.93233862e+01
1716.lowfreq: -15.8995 -11.6015 -0.0008 -0.0007 0.0005 5.3087 8.8669 17.6536 32.1760
frequency: -12.0610 12.5537 32.1120 51.4672 80.5086 123.2511 186.7214 204.0298 216.0713 239.2911 247.3162 321.9227 326.4349 358.4550 402.3229 407.1569 458.1145 505.0665 555.4170 590.0182 617.9594 701.2184 727.5031 753.6480 783.9631 810.9578 853.0604 853.8794 899.9639 907.7996 927.3429 933.1168 946.9202 961.7979 966.9852 976.9121 991.0016 997.9822 1027.3056 1059.5800 1088.8114 1104.1145 1159.9122 1173.3905 1187.5445 1188.8667 1191.5998 1227.8828 1240.1322 1270.2176 1325.2420 1326.4844 1338.4635 1357.9979 1383.3891 1386.2474 1402.4928 1440.9683 1449.7433 1464.7673 1470.1447 1472.2886 1484.1226 1487.7135 1488.1231 1596.4637 1618.0117 1628.3266 2970.9559 2973.2918 2979.8128 3010.3880 3014.1606 3066.7793 3069.4654 3076.8324 3077.7472 3084.0479 3087.9987 3122.2520 3124.2662 3136.5504 3149.3499 3165.4584
redmass: 3.6201 3.4813 6.4785 3.0935 3.4875 4.1435 3.5826 2.5831 1.4694 2.3609 1.4139 2.2043 3.0788 2.1489 2.7919 2.2318 2.9966 3.2763 4.8307 4.7555 6.3292 1.8778 4.2138 1.9347 3.5713 4.1172 1.3242 2.7418 1.6200 4.1611 1.3146 1.6154 1.6403 1.6846 2.0397 1.3936 6.0950 1.3270 2.1669 2.0737 1.5156 1.4881 2.5730 1.0544 1.1366 1.1403 1.9314 2.3232 1.2565 1.5132 1.2767 1.5100 1.3653 1.4880 1.2181 8.7481 1.2163 2.1969 1.1000 1.0434 1.0936 1.0593 1.0469 1.0744 2.3419 6.1386 6.2814 9.5636 1.0720 1.0426 1.0393 1.0616 1.0577 1.0994 1.0999 1.1000 1.1074 1.1015 1.0995 1.0853 1.0883 1.0919 1.0963 1.1017
irintensity: 0.0437 0.0226 1.8330 0.2953 0.1302 0.1468 3.7145 3.4005 3.2409 4.0350 1.5828 0.9274 0.3493 0.8050 0.0027 0.1451 0.9583 18.3275 8.4092 3.9900 0.1346 44.5323 16.7075 67.3422 2.3897 0.6486 0.2206 2.3929 6.4395 97.8820 21.7953 0.3416 2.2233 12.0878 22.1629 0.0415 0.8855 0.0876 3.7076 165.6194 7.3302 7.1393 218.2460 0.0131 0.8907 9.3101 34.4432 6.0992 28.3499 70.3146 0.2803 0.5198 18.7073 5.0468 22.8933 0.3494 19.0677 8.8622 7.8226 1.9039 7.0586 4.4835 23.5325 19.8712 5.4505 0.7656 5.7781 200.0823 21.3357 32.4111 30.8345 19.0145 18.7503 39.7769 20.2217 55.1600 8.0595 23.8116 40.3884 5.2429 2.2485 14.9743 40.3665 20.1033
temp: 298.150 k
press: 1.00000 atm
elementType: 8 8 6 6 6 6 6 6 6 6 6 6 6 6 1 1 1 1 1 1 1 1 1 1 1 1 1 1 1 1
symmnumber: 1
zpe: 658424.3 jmol-1
zpe.correction: 0.250781 hartree
zpe.thermalcorrener: 0.264488 hartree
zpe.thermalcorrenthalpy: 0.265432 hartree
zpe.thermalcorrgfe: 0.208018 hartree
zpe.sumelectzpe: -616.269643 hartree
zpe.sumelectthermal: -616.255936 hartree
zpe.sumelectthermalent: -616.254992 hartree
zpe.sumelectthermalfe: -616.312406 hartree
dipole: -1.1891 1.2545 1.1849
dipole: 2.0957
quadrupole: -76.2724 -82.0275 -85.2352
quadrupole: 3.3143 3.1328 -5.7411
quadrupole: 4.9060 -0.8491 -4.0568 3.3143 3.1328 -5.7411
hfenergy: -616.5204239 hartree
pointgroup: C01 [X(C12H16O2)]
dipole: -0.4826629 -0.4927092 -0.4517532 debye
polarizability: 178.433804|9.2770652|122.6423783|14.8385974|-10.6766846|100.8220101 unknown
InChI: InChI=1S/C12H16O2/c1-10(2)8-12(13)14-9-11-6-4-3-5-7-11/h3-7,10H,8-9H2,1-2H3
charge 0 multiplicity 1
30 atoms
O  0.482211 0.360762 -0.246368
O  2.155181 1.445557 0.960004
C  3.675697 -0.947497 -0.558051
C  2.726328 0.175692 -1.093451
C  4.755537 -0.393627 0.39979
C  2.878538 -2.102616 0.093468
C  1.812888 0.742204 -0.021342
C  -0.51202 0.852608 0.775498
C  -1.876707 0.375414 0.347751
C  -2.684733 1.172736 -0.501695
C  -2.370214 -0.879434 0.78584
C  -3.959618 0.723213 -0.911307
C  -3.644508 -1.332645 0.378652
C  -4.442231 -0.531589 -0.471556
H  4.187615 -1.350016 -1.456817
H  2.103772 -0.222076 -1.912439
H  3.343282 1.005307 -1.487192
H  4.296632 0.067008 1.292007
H  5.428701 -1.205633 0.732106
H  5.371007 0.380075 -0.095988
H  2.398507 -1.769657 1.033265
H  2.084819 -2.478849 -0.577802
H  3.550024 -2.94492 0.341747
H  -0.436805 1.95382 0.813769
H  -0.209056 0.450759 1.758639
H  -2.311285 2.145415 -0.844373
H  -1.752275 -1.502543 1.443784
H  -4.575449 1.348266 -1.567416
H  -4.015961 -2.303916 0.723808
H  -5.432275 -0.880719 -0.785832
