program: Orca
programVersion: 4.2.1
elementType: Cl F F F F F F O N N C C C C C C C C C C C C C C C C H H H H H H H H H H H
charge: 0
multiplicity: 1
keywords: wb97x-d3
keywords: def2-TZVPP
keywords: def2/J RIJCOSX GRIDX6 NOFINALGRIDX
keywords: grid4 nofinalgrid
keywords: scfconv7
keywords: smallprint printgap noloewdin
keywords: NOSOSCF
formula: C16H11ClF6N2O
InChI: InChI=1/C16H11ClF6N2O/c17-12-7-9(15(18,19)20)8-25-13(12)5-6-24-14(26)10-3-1-2-4-11(10)16(21,22)23/h1-4,7-8,24H,5-6H2
37 atoms
Cl -2.635455 -3.480683 -0.274692
F  2.211662 1.761415 -2.417905
F  2.200715 -0.313733 -1.871003
F  0.778653 1.041903 -0.991542
F  -5.04835 1.549882 -0.010405
F  -3.323223 2.748216 -0.475412
F  -4.088039 1.348224 -1.921058
O  3.563127 -2.110497 0.337741
N  1.560355 -1.293855 0.986397
N  -1.189412 -0.189466 1.363132
C  -0.465329 -2.450724 1.726729
C  0.877425 -2.570619 1.010822
C  -1.388163 -1.470423 1.067961
C  3.366006 0.238686 0.658456
C  2.840204 -1.169526 0.625775
C  3.018306 1.217775 -0.27439
C  -2.390208 -1.831197 0.165249
C  -2.973063 0.462673 -0.05814
C  -3.199638 -0.862844 -0.395665
C  4.276327 0.548444 1.661892
C  3.557977 2.495264 -0.171317
C  -1.941941 0.752884 0.820455
C  2.056096 0.925275 -1.388055
C  4.806584 1.824365 1.76515
C  4.44332 2.799435 0.849748
C  -3.854867 1.532794 -0.617473
H  -0.909104 -3.443385 1.77558
H  -0.29765 -2.12453 2.754631
H  1.485479 -3.306864 1.538357
H  0.73331 -2.943538 -0.00684
H  1.041705 -0.47581 1.274772
H  -3.986282 -1.145819 -1.083322
H  4.561617 -0.212167 2.377375
H  3.298017 3.263806 -0.886247
H  -1.71044 1.770116 1.109925
H  5.503978 2.055051 2.559372
H  4.85313 3.797671 0.92251
elementType: Cl F O N C H
totalener: -1860.57207715 hartree
nucrepener: 2619.46998285 hartree
electener: -4480.04206001 hartree
oneelecener: -7772.06970153 hartree
twoeener: 3292.02764153 hartree
cpcmener: -0.02653913 hartree
kineticenergy: 1854.80717269 hartree
xcener: -144.348614311454 hartree
chargesum: 0.0000000
charge: -0.064515 -0.176102 -0.175858 -0.171652 -0.175298 -0.174947 -0.176285 -0.506496 -0.201961 -0.374101 -0.166563 -0.013181 0.218110 0.045795 0.383964 -0.156005 0.016962 -0.039233 -0.089821 -0.183904 -0.077581 -0.013927 0.525111 -0.140036 -0.160049 0.550202 0.096512 0.109597 0.102725 0.101326 0.189490 0.135416 0.147319 0.147965 0.139823 0.162717 0.164480
qa: -0.0645 -0.1761 -0.1759 -0.1717 -0.1753 -0.1749 -0.1763 -0.5065 -0.2020 -0.3741 -0.1666 -0.0132 0.2181 0.0458 0.3840 -0.1560 0.0170 -0.0392 -0.0898 -0.1839 -0.0776 -0.0139 0.5251 -0.1400 -0.1600 0.5502 0.0965 0.1096 0.1027 0.1013 0.1895 0.1354 0.1473 0.1480 0.1398 0.1627 0.1645
va: 1.2531 1.1272 1.1242 1.1090 1.1190 1.1318 1.1254 2.0063 3.1440 3.0058 3.9396 3.8833 3.6883 3.6784 4.1045 3.8338 3.9831 3.6830 4.0932 3.9975 3.8934 4.0634 4.4455 3.9172 3.9183 4.4256 1.0254 1.0262 1.0111 1.0077 1.0309 1.0216 1.0059 1.0074 1.0106 0.9882 0.9888
dispcorr: -0.019377319 hartree
energy: -1860.591454472233
dipole: 23.98325 -24.73672 -0.75347 -5.52779 6.44444 0.91665 19.21796 -17.56494 1.65303
magnitude: 2.03481 au
magnitude: 5.17208 debye
